BDBM50401481 CHEMBL2204572
SMILES: CC[C@H](NC)C(=O)N[C@H]1[C@@H](CNC(=O)c2cn(C[C@H]3CC[C@H]4CC[C@H](N4C(=O)[C@H]3NC(=O)[C@H](CC)NC)C(=O)NC(c3ccccc3)c3ccccc3)nn2)CC[C@H]2CC[C@H](N2C1=O)C(=O)NC(c1ccccc1)c1ccccc1
InChI Key: InChIKey=XQDCNKGNHWZJNL-TWPFRMRKSA-N
Data: 3 IC50
Activity Spreadsheet -- Enzyme Inhibition Constant Data from BindingDB
Found 3 hits for monomerid = 50401481
Trg + Lig
Ki
nM
ΔG°
kcal/mole
IC50
nM
Kd
nM
EC50/IC50
nM
koff
s-1
kon
M-1s-1
pHTemp
°C
X-linked inhibitor of apoptosis protein (XIAP)
(Homo sapiens (Human))
BDBM50401481
(CHEMBL2204572)
Show SMILES CC[C@H](NC)C(=O)N[C@H]1[C@@H](CNC(=O)c2cn(C[C@H]3CC[C@H]4CC[C@H](N4C(=O)[C@H]3NC(=O)[C@H](CC)NC)C(=O)NC(c3ccccc3)c3ccccc3)nn2)CC[C@H]2CC[C@H](N2C1=O)C(=O)NC(c1ccccc1)c1ccccc1 |r|
Show InChI InChI=1S/C61H76N12O7/c1-5-46(62-3)56(75)67-53-42(27-29-44-31-33-49(72(44)60(53)79)58(77)65-51(38-19-11-7-12-20-38)39-21-13-8-14-22-39)35-64-55(74)48-37-71(70-69-48)36-43-28-30-45-32-34-50(73(45)61(80)54(43)68-57(76)47(6-2)63-4)59(78)66-52(40-23-15-9-16-24-40)41-25-17-10-18-26-41/h7-26,37,42-47,49-54,62-63H,5-6,27-36H2,1-4H3,(H,64,74)(H,65,77)(H,66,78)(H,67,75)(H,68,76)/t42-,43-,44+,45+,46+,47+,49+,50+,53+,54+/m1/s1
n/an/a 15.5n/an/an/an/an/an/a
Fondazione IRCCS Istituto Nazionale dei Tumori
Curated by ChEMBL
Assay Description
Displacement of Smac-1F from human His-tagged XIAP linker BIR2-BIR3 linker (124 to 356 residues) after 3 hrs by fluorescent polarization assay
Bioorg Med Chem 20: 6709-23 (2012)
Article DOI: 10.1016/j.bmc.2012.09.041
BindingDB Entry DOI: 10.7270/Q2P84D2Z
Baculoviral IAP repeat-containing protein 2
(Homo sapiens (Human))
BDBM50401481
(CHEMBL2204572)
Show SMILES CC[C@H](NC)C(=O)N[C@H]1[C@@H](CNC(=O)c2cn(C[C@H]3CC[C@H]4CC[C@H](N4C(=O)[C@H]3NC(=O)[C@H](CC)NC)C(=O)NC(c3ccccc3)c3ccccc3)nn2)CC[C@H]2CC[C@H](N2C1=O)C(=O)NC(c1ccccc1)c1ccccc1 |r|
Show InChI InChI=1S/C61H76N12O7/c1-5-46(62-3)56(75)67-53-42(27-29-44-31-33-49(72(44)60(53)79)58(77)65-51(38-19-11-7-12-20-38)39-21-13-8-14-22-39)35-64-55(74)48-37-71(70-69-48)36-43-28-30-45-32-34-50(73(45)61(80)54(43)68-57(76)47(6-2)63-4)59(78)66-52(40-23-15-9-16-24-40)41-25-17-10-18-26-41/h7-26,37,42-47,49-54,62-63H,5-6,27-36H2,1-4H3,(H,64,74)(H,65,77)(H,66,78)(H,67,75)(H,68,76)/t42-,43-,44+,45+,46+,47+,49+,50+,53+,54+/m1/s1
n/an/a 1.70n/an/an/an/an/an/a
Fondazione IRCCS Istituto Nazionale dei Tumori
Curated by ChEMBL
Assay Description
Displacement of FITC-Smac from human recombinant His-tagged cIAP-1 BIR3 domain (245 to 357 residues) after 3 hrs by fluorescent polarization assay
Bioorg Med Chem 20: 6709-23 (2012)
Article DOI: 10.1016/j.bmc.2012.09.041
BindingDB Entry DOI: 10.7270/Q2P84D2Z
X-linked inhibitor of apoptosis protein (XIAP)
(Homo sapiens (Human))
BDBM50401481
(CHEMBL2204572)
Show SMILES CC[C@H](NC)C(=O)N[C@H]1[C@@H](CNC(=O)c2cn(C[C@H]3CC[C@H]4CC[C@H](N4C(=O)[C@H]3NC(=O)[C@H](CC)NC)C(=O)NC(c3ccccc3)c3ccccc3)nn2)CC[C@H]2CC[C@H](N2C1=O)C(=O)NC(c1ccccc1)c1ccccc1 |r|
Show InChI InChI=1S/C61H76N12O7/c1-5-46(62-3)56(75)67-53-42(27-29-44-31-33-49(72(44)60(53)79)58(77)65-51(38-19-11-7-12-20-38)39-21-13-8-14-22-39)35-64-55(74)48-37-71(70-69-48)36-43-28-30-45-32-34-50(73(45)61(80)54(43)68-57(76)47(6-2)63-4)59(78)66-52(40-23-15-9-16-24-40)41-25-17-10-18-26-41/h7-26,37,42-47,49-54,62-63H,5-6,27-36H2,1-4H3,(H,64,74)(H,65,77)(H,66,78)(H,67,75)(H,68,76)/t42-,43-,44+,45+,46+,47+,49+,50+,53+,54+/m1/s1
n/an/a 244n/an/an/an/an/an/a
Fondazione IRCCS Istituto Nazionale dei Tumori
Curated by ChEMBL
Assay Description
Displacement of FITC-Smac from human His-tagged XIAP BIR3 domain (241 to 356 residues) after 3 hrs by fluorescent polarization assay
Bioorg Med Chem 20: 6709-23 (2012)
Article DOI: 10.1016/j.bmc.2012.09.041
BindingDB Entry DOI: 10.7270/Q2P84D2Z