BDBM50401557 CHEMBL2207099
SMILES: Cn1nnnc1Cc1ncc(Cl)cc1NS(=O)(=O)c1ccc(Cl)c(Cl)c1
InChI Key: InChIKey=ICBWFOBAWJKURO-UHFFFAOYSA-N
Data: 3 KI  5 IC50
Activity Spreadsheet -- Enzyme Inhibition Constant Data from BindingDB
Found 8 hits for monomerid = 50401557
Trg + Lig
Ki
nM
ΔG°
kcal/mole
IC50
nM
Kd
nM
EC50/IC50
nM
koff
s-1
kon
M-1s-1
pHTemp
°C
C-C chemokine receptor type 2
(Homo sapiens (Human))
BDBM50401557
(CHEMBL2207099)
Show SMILES Cn1nnnc1Cc1ncc(Cl)cc1NS(=O)(=O)c1ccc(Cl)c(Cl)c1
Show InChI InChI=1S/C14H11Cl3N6O2S/c1-23-14(19-21-22-23)6-12-13(4-8(15)7-18-12)20-26(24,25)9-2-3-10(16)11(17)5-9/h2-5,7,20H,6H2,1H3
25.1n/an/an/an/an/an/an/an/a
GlaxoSmithKline Research and Development
Curated by ChEMBL
Assay Description
Binding affinity to CCR2 by 35S-gamma-GTP membrane assay
Bioorg Med Chem Lett 22: 7252-5 (2012)
Article DOI: 10.1016/j.bmcl.2012.09.020
BindingDB Entry DOI: 10.7270/Q21J9BZJ
C-C chemokine receptor type 1
(Homo sapiens (Human))
BDBM50401557
(CHEMBL2207099)
Show SMILES Cn1nnnc1Cc1ncc(Cl)cc1NS(=O)(=O)c1ccc(Cl)c(Cl)c1
Show InChI InChI=1S/C14H11Cl3N6O2S/c1-23-14(19-21-22-23)6-12-13(4-8(15)7-18-12)20-26(24,25)9-2-3-10(16)11(17)5-9/h2-5,7,20H,6H2,1H3
Reactome pathway
1.00E+3n/an/an/an/an/an/an/an/a
GlaxoSmithKline Research and Development
Curated by ChEMBL
Assay Description
Binding affinity to CCR1 by 35S-gamma-GTP membrane assay
Bioorg Med Chem Lett 22: 7252-5 (2012)
Article DOI: 10.1016/j.bmcl.2012.09.020
BindingDB Entry DOI: 10.7270/Q21J9BZJ
C-C chemokine receptor type 4 (CCR4)
(Homo sapiens (Human))
BDBM50401557
(CHEMBL2207099)
Show SMILES Cn1nnnc1Cc1ncc(Cl)cc1NS(=O)(=O)c1ccc(Cl)c(Cl)c1
Show InChI InChI=1S/C14H11Cl3N6O2S/c1-23-14(19-21-22-23)6-12-13(4-8(15)7-18-12)20-26(24,25)9-2-3-10(16)11(17)5-9/h2-5,7,20H,6H2,1H3
2.00E+3n/an/an/an/an/an/an/an/a
GlaxoSmithKline Research and Development
Curated by ChEMBL
Assay Description
Binding affinity to CCR4 by 35S-gamma-GTP membrane assay
Bioorg Med Chem Lett 22: 7252-5 (2012)
Article DOI: 10.1016/j.bmcl.2012.09.020
BindingDB Entry DOI: 10.7270/Q21J9BZJ
Cytochrome P450 1A
(Homo sapiens (Human))
BDBM50401557
(CHEMBL2207099)
Show SMILES Cn1nnnc1Cc1ncc(Cl)cc1NS(=O)(=O)c1ccc(Cl)c(Cl)c1
Show InChI InChI=1S/C14H11Cl3N6O2S/c1-23-14(19-21-22-23)6-12-13(4-8(15)7-18-12)20-26(24,25)9-2-3-10(16)11(17)5-9/h2-5,7,20H,6H2,1H3
Reactome pathway
n/an/a>2.51E+4n/an/an/an/an/an/a
GlaxoSmithKline Research and Development
Curated by ChEMBL
Assay Description
Inhibition of cytochrome P450 1A2
Bioorg Med Chem Lett 22: 7252-5 (2012)
Article DOI: 10.1016/j.bmcl.2012.09.020
BindingDB Entry DOI: 10.7270/Q21J9BZJ
Cytochrome P450 2D6
(Homo sapiens (Human))
BDBM50401557
(CHEMBL2207099)
Show SMILES Cn1nnnc1Cc1ncc(Cl)cc1NS(=O)(=O)c1ccc(Cl)c(Cl)c1
Show InChI InChI=1S/C14H11Cl3N6O2S/c1-23-14(19-21-22-23)6-12-13(4-8(15)7-18-12)20-26(24,25)9-2-3-10(16)11(17)5-9/h2-5,7,20H,6H2,1H3
n/an/a>2.51E+4n/an/an/an/an/an/a
GlaxoSmithKline Research and Development
Curated by ChEMBL
Assay Description
Inhibition of cytochrome P450 2D6
Bioorg Med Chem Lett 22: 7252-5 (2012)
Article DOI: 10.1016/j.bmcl.2012.09.020
BindingDB Entry DOI: 10.7270/Q21J9BZJ
Cytochrome P450 2C19
(Homo sapiens (Human))
BDBM50401557
(CHEMBL2207099)
Show SMILES Cn1nnnc1Cc1ncc(Cl)cc1NS(=O)(=O)c1ccc(Cl)c(Cl)c1
Show InChI InChI=1S/C14H11Cl3N6O2S/c1-23-14(19-21-22-23)6-12-13(4-8(15)7-18-12)20-26(24,25)9-2-3-10(16)11(17)5-9/h2-5,7,20H,6H2,1H3
Reactome pathway
n/an/a 2.51E+4n/an/an/an/an/an/a
GlaxoSmithKline Research and Development
Curated by ChEMBL
Assay Description
Inhibition of cytochrome P450 2C19
Bioorg Med Chem Lett 22: 7252-5 (2012)
Article DOI: 10.1016/j.bmcl.2012.09.020
BindingDB Entry DOI: 10.7270/Q21J9BZJ
Cytochrome P450 2C9
(Homo sapiens (Human))
BDBM50401557
(CHEMBL2207099)
Show SMILES Cn1nnnc1Cc1ncc(Cl)cc1NS(=O)(=O)c1ccc(Cl)c(Cl)c1
Show InChI InChI=1S/C14H11Cl3N6O2S/c1-23-14(19-21-22-23)6-12-13(4-8(15)7-18-12)20-26(24,25)9-2-3-10(16)11(17)5-9/h2-5,7,20H,6H2,1H3
Reactome pathway
n/an/a 1.58E+3n/an/an/an/an/an/a
GlaxoSmithKline Research and Development
Curated by ChEMBL
Assay Description
Inhibition of cytochrome P450 2C9
Bioorg Med Chem Lett 22: 7252-5 (2012)
Article DOI: 10.1016/j.bmcl.2012.09.020
BindingDB Entry DOI: 10.7270/Q21J9BZJ
Cytochrome P450 3A4
(Homo sapiens (Human))
BDBM50401557
(CHEMBL2207099)
Show SMILES Cn1nnnc1Cc1ncc(Cl)cc1NS(=O)(=O)c1ccc(Cl)c(Cl)c1
Show InChI InChI=1S/C14H11Cl3N6O2S/c1-23-14(19-21-22-23)6-12-13(4-8(15)7-18-12)20-26(24,25)9-2-3-10(16)11(17)5-9/h2-5,7,20H,6H2,1H3
Reactome pathway
n/an/a 1.00E+4n/an/an/an/an/an/a
GlaxoSmithKline Research and Development
Curated by ChEMBL
Assay Description
Inhibition of cytochrome P450 3A4
Bioorg Med Chem Lett 22: 7252-5 (2012)
Article DOI: 10.1016/j.bmcl.2012.09.020
BindingDB Entry DOI: 10.7270/Q21J9BZJ