BDBM50401627 CHEMBL2203844
SMILES: COc1cc(Nc2cnc(C#N)c(O[C@@H]3CCNC3)n2)ncc1-c1cnn(C)c1
InChI Key: InChIKey=UEMHXHXGMBIAGT-CYBMUJFWSA-N
Data: 2 IC50
Activity Spreadsheet -- Enzyme Inhibition Constant Data from BindingDB
Found 2 hits for monomerid = 50401627
Trg + Lig
Ki
nM
ΔG°
kcal/mole
IC50
nM
Kd
nM
EC50/IC50
nM
koff
s-1
kon
M-1s-1
pHTemp
°C
Serine/threonine-protein kinase Chk1
(Homo sapiens (Human))
BDBM50401627
(CHEMBL2203844)
Show SMILES COc1cc(Nc2cnc(C#N)c(O[C@@H]3CCNC3)n2)ncc1-c1cnn(C)c1 |r|
Show InChI InChI=1S/C19H20N8O2/c1-27-11-12(7-24-27)14-9-23-17(5-16(14)28-2)25-18-10-22-15(6-20)19(26-18)29-13-3-4-21-8-13/h5,7,9-11,13,21H,3-4,8H2,1-2H3,(H,23,25,26)/t13-/m1/s1
Reactome pathway
n/an/a 29n/an/an/an/an/an/a
Institute of Cancer Research
Curated by ChEMBL
Assay Description
Inhibition of CHK1 in human HT-29 cells assessed as etoposide-induced G2 check point arrest after 21 hrs by ELISA
J Med Chem 55: 10229-40 (2012)
Article DOI: 10.1021/jm3012933
BindingDB Entry DOI: 10.7270/Q2N87BZM
Serine/threonine-protein kinase Chk1
(Homo sapiens (Human))
BDBM50401627
(CHEMBL2203844)
Show SMILES COc1cc(Nc2cnc(C#N)c(O[C@@H]3CCNC3)n2)ncc1-c1cnn(C)c1 |r|
Show InChI InChI=1S/C19H20N8O2/c1-27-11-12(7-24-27)14-9-23-17(5-16(14)28-2)25-18-10-22-15(6-20)19(26-18)29-13-3-4-21-8-13/h5,7,9-11,13,21H,3-4,8H2,1-2H3,(H,23,25,26)/t13-/m1/s1
Reactome pathway
n/an/a<1n/an/an/an/an/an/a
Institute of Cancer Research
Curated by ChEMBL
Assay Description
Inhibition of CHK1 using 5-FAM-KKKVSRSGLYRSPSMPENLNRPR-COOH as substrate after 1 hr by microfluidic assay in presence of ATP
J Med Chem 55: 10229-40 (2012)
Article DOI: 10.1021/jm3012933
BindingDB Entry DOI: 10.7270/Q2N87BZM