BDBM50402077 CHEMBL2206623
SMILES: CC(=O)NCCc1nc2cnc3[nH]ccc3c2n1C1CCN(CCC#N)CC1
InChI Key: InChIKey=HSLAVUBHRFFYBB-UHFFFAOYSA-N
Data: 1 KI  1 EC50
Activity Spreadsheet -- Enzyme Inhibition Constant Data from BindingDB
Found 2 hits for monomerid = 50402077
Trg + Lig
Ki
nM
ΔG°
kcal/mole
IC50
nM
Kd
nM
EC50/IC50
nM
koff
s-1
kon
M-1s-1
pHTemp
°C
Tyrosine-protein kinase JAK1
(Homo sapiens (Human))
BDBM50402077
(CHEMBL2206623)
Show SMILES CC(=O)NCCc1nc2cnc3[nH]ccc3c2n1C1CCN(CCC#N)CC1
Show InChI InChI=1S/C20H25N7O/c1-14(28)22-9-4-18-25-17-13-24-20-16(3-8-23-20)19(17)27(18)15-5-11-26(12-6-15)10-2-7-21/h3,8,13,15H,2,4-6,9-12H2,1H3,(H,22,28)(H,23,24)
Reactome pathway
3.70n/an/an/an/an/an/an/an/a
Genentech
Curated by ChEMBL
Assay Description
Inhibition of JAK1 kinase domain assessed as phosphorylation of N-terminal 5-carboxyfluorescein-tagged Val-Ala-Leu-Val-Asp-Gly-Tyr-Phe-Arg-Leu-Thr-Th...
Bioorg Med Chem Lett 22: 7627-33 (2012)
Article DOI: 10.1016/j.bmcl.2012.10.008
BindingDB Entry DOI: 10.7270/Q2P55PPP
Tyrosine-protein kinase JAK1
(Homo sapiens (Human))
BDBM50402077
(CHEMBL2206623)
Show SMILES CC(=O)NCCc1nc2cnc3[nH]ccc3c2n1C1CCN(CCC#N)CC1
Show InChI InChI=1S/C20H25N7O/c1-14(28)22-9-4-18-25-17-13-24-20-16(3-8-23-20)19(17)27(18)15-5-11-26(12-6-15)10-2-7-21/h3,8,13,15H,2,4-6,9-12H2,1H3,(H,22,28)(H,23,24)
Reactome pathway
n/an/an/an/a>6.50E+3n/an/an/an/a
Genentech
Curated by ChEMBL
Assay Description
Inhibition of JAK1 in human TF1 cells assessed as inhibition of IL6-induced STAT3 phosphorylation incubated for 20 mins prior to IL6-induction measur...
Bioorg Med Chem Lett 22: 7627-33 (2012)
Article DOI: 10.1016/j.bmcl.2012.10.008
BindingDB Entry DOI: 10.7270/Q2P55PPP