BDBM50402104 CHEMBL2206628
SMILES: CS(=O)(=O)NCc1nc2cnc3[nH]ccc3c2n1[C@@H]1CCC[C@@H](O)C1
InChI Key: InChIKey=NXWISJUEZUPPDJ-GHMZBOCLSA-N
Data: 1 KI  1 EC50
Activity Spreadsheet -- Enzyme Inhibition Constant Data from BindingDB
Found 2 hits for monomerid = 50402104
Trg + Lig
Ki
nM
ΔG°
kcal/mole
IC50
nM
Kd
nM
EC50/IC50
nM
koff
s-1
kon
M-1s-1
pHTemp
°C
Tyrosine-protein kinase JAK1
(Homo sapiens (Human))
BDBM50402104
(CHEMBL2206628)
Show SMILES CS(=O)(=O)NCc1nc2cnc3[nH]ccc3c2n1[C@@H]1CCC[C@@H](O)C1 |r|
Show InChI InChI=1S/C16H21N5O3S/c1-25(23,24)19-9-14-20-13-8-18-16-12(5-6-17-16)15(13)21(14)10-3-2-4-11(22)7-10/h5-6,8,10-11,19,22H,2-4,7,9H2,1H3,(H,17,18)/t10-,11-/m1/s1
Reactome pathway
4.20n/an/an/an/an/an/an/an/a
Genentech
Curated by ChEMBL
Assay Description
Inhibition of JAK1 kinase domain assessed as phosphorylation of N-terminal 5-carboxyfluorescein-tagged Val-Ala-Leu-Val-Asp-Gly-Tyr-Phe-Arg-Leu-Thr-Th...
Bioorg Med Chem Lett 22: 7627-33 (2012)
Article DOI: 10.1016/j.bmcl.2012.10.008
BindingDB Entry DOI: 10.7270/Q2P55PPP
Tyrosine-protein kinase JAK1
(Homo sapiens (Human))
BDBM50402104
(CHEMBL2206628)
Show SMILES CS(=O)(=O)NCc1nc2cnc3[nH]ccc3c2n1[C@@H]1CCC[C@@H](O)C1 |r|
Show InChI InChI=1S/C16H21N5O3S/c1-25(23,24)19-9-14-20-13-8-18-16-12(5-6-17-16)15(13)21(14)10-3-2-4-11(22)7-10/h5-6,8,10-11,19,22H,2-4,7,9H2,1H3,(H,17,18)/t10-,11-/m1/s1
Reactome pathway
n/an/an/an/a 2.20E+3n/an/an/an/a
Genentech
Curated by ChEMBL
Assay Description
Inhibition of JAK1 in human TF1 cells assessed as inhibition of IL6-induced STAT3 phosphorylation incubated for 20 mins prior to IL6-induction measur...
Bioorg Med Chem Lett 22: 7627-33 (2012)
Article DOI: 10.1016/j.bmcl.2012.10.008
BindingDB Entry DOI: 10.7270/Q2P55PPP