BDBM50402174 CHEMBL2208017
SMILES: Cc1csc(n1)-c1[nH]c(CN2CCOC2=O)nc1-c1ccc2ncsc2c1
InChI Key: InChIKey=GPJWZJBHICKXBV-UHFFFAOYSA-N
Data: 2 IC50
Activity Spreadsheet -- Enzyme Inhibition Constant Data from BindingDB
Found 2 hits for monomerid = 50402174
Trg + Lig
Ki
nM
ΔG°
kcal/mole
IC50
nM
Kd
nM
EC50/IC50
nM
koff
s-1
kon
M-1s-1
pHTemp
°C
TGF-beta receptor type-1
(Homo sapiens (Human))
BDBM50402174
(CHEMBL2208017)
Show SMILES Cc1csc(n1)-c1[nH]c(CN2CCOC2=O)nc1-c1ccc2ncsc2c1
Show InChI InChI=1S/C18H15N5O2S2/c1-10-8-26-17(20-10)16-15(11-2-3-12-13(6-11)27-9-19-12)21-14(22-16)7-23-4-5-25-18(23)24/h2-3,6,8-9H,4-5,7H2,1H3,(H,21,22)
n/an/a 92n/an/an/an/an/an/a
Taisho Pharmaceutical Co., Ltd
Curated by ChEMBL
Assay Description
Inhibition of ALK5-mediated TNFalpha-induced Smad2/3 phosphorylation in human A549 cells preincubated for 2 hrs before addition of TNFalpha after 1 h...
Bioorg Med Chem 20: 7128-38 (2012)
Article DOI: 10.1016/j.bmc.2012.09.066
BindingDB Entry DOI: 10.7270/Q2542PQ0
TGF-beta receptor type-1
(Homo sapiens (Human))
BDBM50402174
(CHEMBL2208017)
Show SMILES Cc1csc(n1)-c1[nH]c(CN2CCOC2=O)nc1-c1ccc2ncsc2c1
Show InChI InChI=1S/C18H15N5O2S2/c1-10-8-26-17(20-10)16-15(11-2-3-12-13(6-11)27-9-19-12)21-14(22-16)7-23-4-5-25-18(23)24/h2-3,6,8-9H,4-5,7H2,1H3,(H,21,22)
n/an/a 8.10n/an/an/an/an/an/a
Taisho Pharmaceutical Co., Ltd
Curated by ChEMBL
Assay Description
Inhibition of human ALK5 using GST-tagged Smad3 as substrate assessed as substrate phosphorylation after 30 mins by ELISA
Bioorg Med Chem 20: 7128-38 (2012)
Article DOI: 10.1016/j.bmc.2012.09.066
BindingDB Entry DOI: 10.7270/Q2542PQ0