BDBM50402199 CHEMBL2203967
SMILES: CCCCCn1ccc2cc(cnc12)-c1cc(cc(=O)n1O)-c1ccccc1
InChI Key: InChIKey=OCLGWFAOMNZCGA-UHFFFAOYSA-N
Data: 1 IC50
Activity Spreadsheet -- Enzyme Inhibition Constant Data from BindingDB
Found 1 hit for monomerid = 50402199
Trg + Lig
Ki
nM
ΔG°
kcal/mole
IC50
nM
Kd
nM
EC50/IC50
nM
koff
s-1
kon
M-1s-1
pHTemp
°C
Glyoxalase 1 (GLO1)
(Homo sapiens (Human))
BDBM50402199
(CHEMBL2203967)
Show SMILES CCCCCn1ccc2cc(cnc12)-c1cc(cc(=O)n1O)-c1ccccc1
Show InChI InChI=1S/C23H23N3O2/c1-2-3-7-11-25-12-10-18-13-20(16-24-23(18)25)21-14-19(15-22(27)26(21)28)17-8-5-4-6-9-17/h4-6,8-10,12-16,28H,2-3,7,11H2,1H3
n/an/a 510n/an/an/an/an/an/a
Chugai Pharmaceutical Co., Ltd
Curated by ChEMBL
Assay Description
Inhibition of human recombinant GLO1 expressed in Escherichia coli BL21 assessed as decrease in reduced glutathione level after 1 hr by Ellman's meth...
Bioorg Med Chem Lett 22: 7486-9 (2012)
Article DOI: 10.1016/j.bmcl.2012.10.045
BindingDB Entry DOI: 10.7270/Q2RX9D8Q