BDBM50402200 CHEMBL2203966
SMILES: CCCCn1ccc2cc(cnc12)-c1cc(cc(=O)n1O)-c1ccccc1
InChI Key: InChIKey=BHQOTGDLLAGNKF-UHFFFAOYSA-N
Data: 1 IC50
Activity Spreadsheet -- Enzyme Inhibition Constant Data from BindingDB
Found 1 hit for monomerid = 50402200
Trg + Lig
Ki
nM
ΔG°
kcal/mole
IC50
nM
Kd
nM
EC50/IC50
nM
koff
s-1
kon
M-1s-1
pHTemp
°C
Glyoxalase 1 (GLO1)
(Homo sapiens (Human))
BDBM50402200
(CHEMBL2203966)
Show SMILES CCCCn1ccc2cc(cnc12)-c1cc(cc(=O)n1O)-c1ccccc1
Show InChI InChI=1S/C22H21N3O2/c1-2-3-10-24-11-9-17-12-19(15-23-22(17)24)20-13-18(14-21(26)25(20)27)16-7-5-4-6-8-16/h4-9,11-15,27H,2-3,10H2,1H3
n/an/a 300n/an/an/an/an/an/a
Chugai Pharmaceutical Co., Ltd
Curated by ChEMBL
Assay Description
Inhibition of human recombinant GLO1 expressed in Escherichia coli BL21 assessed as decrease in reduced glutathione level after 1 hr by Ellman's meth...
Bioorg Med Chem Lett 22: 7486-9 (2012)
Article DOI: 10.1016/j.bmcl.2012.10.045
BindingDB Entry DOI: 10.7270/Q2RX9D8Q