BDBM50402204 CHEMBL2203978
SMILES: COCCn1ccc2cc(cnc12)-c1cc(cc(=O)n1O)-c1ccccc1
InChI Key: InChIKey=UDERDBUIILFLCF-UHFFFAOYSA-N
Data: 1 IC50
Activity Spreadsheet -- Enzyme Inhibition Constant Data from BindingDB
Found 1 hit for monomerid = 50402204
Trg + Lig
Ki
nM
ΔG°
kcal/mole
IC50
nM
Kd
nM
EC50/IC50
nM
koff
s-1
kon
M-1s-1
pHTemp
°C
Glyoxalase 1 (GLO1)
(Homo sapiens (Human))
BDBM50402204
(CHEMBL2203978)
Show SMILES COCCn1ccc2cc(cnc12)-c1cc(cc(=O)n1O)-c1ccccc1
Show InChI InChI=1S/C21H19N3O3/c1-27-10-9-23-8-7-16-11-18(14-22-21(16)23)19-12-17(13-20(25)24(19)26)15-5-3-2-4-6-15/h2-8,11-14,26H,9-10H2,1H3
n/an/a 14n/an/an/an/an/an/a
Chugai Pharmaceutical Co., Ltd
Curated by ChEMBL
Assay Description
Inhibition of human recombinant GLO1 expressed in Escherichia coli BL21 assessed as decrease in reduced glutathione level after 1 hr by Ellman's meth...
Bioorg Med Chem Lett 22: 7486-9 (2012)
Article DOI: 10.1016/j.bmcl.2012.10.045
BindingDB Entry DOI: 10.7270/Q2RX9D8Q