BDBM50402211 CHEMBL2203971
SMILES: On1c(cc(cc1=O)-c1ccc(cc1)-c1ccccc1)-c1ccccc1
InChI Key: InChIKey=FSPJPMAPOYCPCZ-UHFFFAOYSA-N
Data: 1 IC50
Activity Spreadsheet -- Enzyme Inhibition Constant Data from BindingDB
Found 1 hit for monomerid = 50402211
Trg + Lig
Ki
nM
ΔG°
kcal/mole
IC50
nM
Kd
nM
EC50/IC50
nM
koff
s-1
kon
M-1s-1
pHTemp
°C
Glyoxalase 1 (GLO1)
(Homo sapiens (Human))
BDBM50402211
(CHEMBL2203971)
Show SMILES On1c(cc(cc1=O)-c1ccc(cc1)-c1ccccc1)-c1ccccc1
Show InChI InChI=1S/C23H17NO2/c25-23-16-21(15-22(24(23)26)20-9-5-2-6-10-20)19-13-11-18(12-14-19)17-7-3-1-4-8-17/h1-16,26H
n/an/a 8.40E+3n/an/an/an/an/an/a
Chugai Pharmaceutical Co., Ltd
Curated by ChEMBL
Assay Description
Inhibition of human recombinant GLO1 expressed in Escherichia coli BL21 assessed as decrease in reduced glutathione level after 1 hr by Ellman's meth...
Bioorg Med Chem Lett 22: 7486-9 (2012)
Article DOI: 10.1016/j.bmcl.2012.10.045
BindingDB Entry DOI: 10.7270/Q2RX9D8Q