BDBM50402272 CHEMBL2205509
SMILES: CC(C)COc1ccc(cc1C#N)-c1cc(=O)[nH]c(N)n1
InChI Key: InChIKey=WVQWUBPIFLOXTK-UHFFFAOYSA-N
Data: 2 IC50
Activity Spreadsheet -- Enzyme Inhibition Constant Data from BindingDB
Found 2 hits for monomerid = 50402272
Trg + Lig
Ki
nM
ΔG°
kcal/mole
IC50
nM
Kd
nM
EC50/IC50
nM
koff
s-1
kon
M-1s-1
pHTemp
°C
Xanthine dehydrogenase/oxidase
(Homo sapiens (Human))
BDBM50402272
(CHEMBL2205509)
Show SMILES CC(C)COc1ccc(cc1C#N)-c1cc(=O)[nH]c(N)n1
Show InChI InChI=1S/C15H16N4O2/c1-9(2)8-21-13-4-3-10(5-11(13)7-16)12-6-14(20)19-15(17)18-12/h3-6,9H,8H2,1-2H3,(H3,17,18,19,20)
n/an/a 20n/an/an/an/an/an/a
Piramal Healthcare Limited
Curated by ChEMBL
Assay Description
Inhibition of xanthine oxidase using xanthine as substrate at 30 mins by spectrophotometric analysis
Bioorg Med Chem Lett 22: 7543-6 (2012)
Article DOI: 10.1016/j.bmcl.2012.10.029
BindingDB Entry DOI: 10.7270/Q2445NNH
Xanthine dehydrogenase/oxidase
(Homo sapiens (Human))
BDBM50402272
(CHEMBL2205509)
Show SMILES CC(C)COc1ccc(cc1C#N)-c1cc(=O)[nH]c(N)n1
Show InChI InChI=1S/C15H16N4O2/c1-9(2)8-21-13-4-3-10(5-11(13)7-16)12-6-14(20)19-15(17)18-12/h3-6,9H,8H2,1-2H3,(H3,17,18,19,20)
n/an/a 25n/an/an/an/an/an/a
AstraZeneca
Curated by ChEMBL
Assay Description
Inhibition of C-terminally FLAG-tagged human xanthine oxidase (amino acid 1 to 1333) expressed in baculovirus system after 15 mins by spectrophotomet...
Bioorg Med Chem Lett 24: 1315-21 (2014)
Article DOI: 10.1016/j.bmcl.2014.01.050
BindingDB Entry DOI: 10.7270/Q2V69M3N