BDBM50402343 CHEMBL2206664
SMILES: O=C(Nc1ccccc1)Nc1ccccc1Oc1ccc2nccn2n1
InChI Key: InChIKey=KQLKQYRVWDOSNS-UHFFFAOYSA-N
Data: 1 IC50
Activity Spreadsheet -- Enzyme Inhibition Constant Data from BindingDB
Found 1 hit for monomerid = 50402343
Trg + Lig
Ki
nM
ΔG°
kcal/mole
IC50
nM
Kd
nM
EC50/IC50
nM
koff
s-1
kon
M-1s-1
pHTemp
°C
Vascular endothelial growth factor receptor 2
(Homo sapiens (Human))
BDBM50402343
(CHEMBL2206664)
Show SMILES O=C(Nc1ccccc1)Nc1ccccc1Oc1ccc2nccn2n1
Show InChI InChI=1S/C19H15N5O2/c25-19(21-14-6-2-1-3-7-14)22-15-8-4-5-9-16(15)26-18-11-10-17-20-12-13-24(17)23-18/h1-13H,(H2,21,22,25)
NCI pathway
Reactome pathway
n/an/a>1.00E+4n/an/an/an/an/an/a
Takeda Pharmaceutical Company Limited
Curated by ChEMBL
Assay Description
Inhibition of human VEGFR2 for 5 mins prior to addition of 10 uM ATP using poly-GluTyr by AlphaScreen analysis
Bioorg Med Chem 20: 7051-8 (2012)
Article DOI: 10.1016/j.bmc.2012.10.004
BindingDB Entry DOI: 10.7270/Q2GF0VN9