BDBM50402393 CHEMBL2207740
SMILES: CC(=O)N1CC2CC1CN2CCOc1ccc(Oc2nc3ncccc3s2)cc1
InChI Key: InChIKey=JADNQJXGBOGYGV-UHFFFAOYSA-N
Data: 2 IC50
Activity Spreadsheet -- Enzyme Inhibition Constant Data from BindingDB
Found 2 hits for monomerid = 50402393
Trg + Lig
Ki
nM
ΔG°
kcal/mole
IC50
nM
Kd
nM
EC50/IC50
nM
koff
s-1
kon
M-1s-1
pHTemp
°C
Potassium voltage-gated channel subfamily H member 2
(Homo sapiens (Human))
BDBM50402393
(CHEMBL2207740)
Show SMILES CC(=O)N1CC2CC1CN2CCOc1ccc(Oc2nc3ncccc3s2)cc1 |THB:10:9:6:4.3,1:3:8.9:6|
Show InChI InChI=1S/C21H22N4O3S/c1-14(26)25-13-15-11-16(25)12-24(15)9-10-27-17-4-6-18(7-5-17)28-21-23-20-19(29-21)3-2-8-22-20/h2-8,15-16H,9-13H2,1H3
Reactome pathway
n/an/a>1.00E+4n/an/an/an/an/an/a
Janssen Research& Development LLC
Curated by ChEMBL
Assay Description
Inhibition of dofetilide binding to human ERG by patch clamp assay
Bioorg Med Chem Lett 22: 7504-11 (2012)
Article DOI: 10.1016/j.bmcl.2012.10.036
BindingDB Entry DOI: 10.7270/Q2ZG6TDQ
Leukotriene A4 hydrolase
(Homo sapiens (Human))
BDBM50402393
(CHEMBL2207740)
Show SMILES CC(=O)N1CC2CC1CN2CCOc1ccc(Oc2nc3ncccc3s2)cc1 |THB:10:9:6:4.3,1:3:8.9:6|
Show InChI InChI=1S/C21H22N4O3S/c1-14(26)25-13-15-11-16(25)12-24(15)9-10-27-17-4-6-18(7-5-17)28-21-23-20-19(29-21)3-2-8-22-20/h2-8,15-16H,9-13H2,1H3
Reactome pathway
n/an/a 7n/an/an/an/an/an/a
Janssen Research& Development LLC
Curated by ChEMBL
Assay Description
Inhibition of human recombinant LTA4 hydrolase expressed in SF9 cells using LTA4 as substrate assessed as LTB4 production incubated for 10 mins prior...
Bioorg Med Chem Lett 22: 7504-11 (2012)
Article DOI: 10.1016/j.bmcl.2012.10.036
BindingDB Entry DOI: 10.7270/Q2ZG6TDQ