BDBM50402594 CHEMBL2206161
SMILES: CCC(=NNC(=O)c1cc2ccccc2cc1O)c1cc2c(F)c(F)c(F)cc2n1C
InChI Key: InChIKey=NQSDTXKCFAYCQW-UHFFFAOYSA-N
Data: 1 IC50
Activity Spreadsheet -- Enzyme Inhibition Constant Data from BindingDB
Found 1 hit for monomerid = 50402594
Trg + Lig
Ki
nM
ΔG°
kcal/mole
IC50
nM
Kd
nM
EC50/IC50
nM
koff
s-1
kon
M-1s-1
pHTemp
°C
Pyruvate kinase
(Staphylococcus aureus (strain MRSA252))
BDBM50402594
(CHEMBL2206161)
Show SMILES CCC(=NNC(=O)c1cc2ccccc2cc1O)c1cc2c(F)c(F)c(F)cc2n1C |w:3.3|
Show InChI InChI=1S/C23H18F3N3O2/c1-3-17(19-10-14-18(29(19)2)11-16(24)22(26)21(14)25)27-28-23(31)15-8-12-6-4-5-7-13(12)9-20(15)30/h4-11,30H,3H2,1-2H3,(H,28,31)
n/an/a 52n/an/an/an/an/an/a
Simon Fraser University
Curated by ChEMBL
Assay Description
Inhibition of methicillin-resistant Staphylococcus aureus 252 pyruvate kinase by LDH assay
Bioorg Med Chem 20: 7069-82 (2012)
Article DOI: 10.1016/j.bmc.2012.10.002
BindingDB Entry DOI: 10.7270/Q2NZ88ST