BDBM50402600 CHEMBL2206155
SMILES: CC(=NNC(=O)c1cc2ccccc2cc1O)c1cc2cc(Br)ccc2[nH]1
InChI Key: InChIKey=RSXFFJLALFFBKB-UHFFFAOYSA-N
Data: 1 IC50
Activity Spreadsheet -- Enzyme Inhibition Constant Data from BindingDB
Found 1 hit for monomerid = 50402600
Trg + Lig
Ki
nM
ΔG°
kcal/mole
IC50
nM
Kd
nM
EC50/IC50
nM
koff
s-1
kon
M-1s-1
pHTemp
°C
Pyruvate kinase
(Staphylococcus aureus (strain MRSA252))
BDBM50402600
(CHEMBL2206155)
Show SMILES CC(=NNC(=O)c1cc2ccccc2cc1O)c1cc2cc(Br)ccc2[nH]1 |w:2.2|
Show InChI InChI=1S/C21H16BrN3O2/c1-12(19-10-15-8-16(22)6-7-18(15)23-19)24-25-21(27)17-9-13-4-2-3-5-14(13)11-20(17)26/h2-11,23,26H,1H3,(H,25,27)
n/an/a 26n/an/an/an/an/an/a
Simon Fraser University
Curated by ChEMBL
Assay Description
Inhibition of methicillin-resistant Staphylococcus aureus 252 pyruvate kinase by LDH assay
Bioorg Med Chem 20: 7069-82 (2012)
Article DOI: 10.1016/j.bmc.2012.10.002
BindingDB Entry DOI: 10.7270/Q2NZ88ST