BDBM50402617 CHEMBL2206174
SMILES: CCOc1ccc(Br)cc1C(=O)NN=C(C)c1cc2ccccc2[nH]1
InChI Key: InChIKey=FASNZJCSCBVTBZ-UHFFFAOYSA-N
Data: 1 IC50
Activity Spreadsheet -- Enzyme Inhibition Constant Data from BindingDB
Found 1 hit for monomerid = 50402617
Trg + Lig
Ki
nM
ΔG°
kcal/mole
IC50
nM
Kd
nM
EC50/IC50
nM
koff
s-1
kon
M-1s-1
pHTemp
°C
Pyruvate kinase
(Staphylococcus aureus (strain MRSA252))
BDBM50402617
(CHEMBL2206174)
Show SMILES CCOc1ccc(Br)cc1C(=O)NN=C(C)c1cc2ccccc2[nH]1 |w:13.13|
Show InChI InChI=1S/C19H18BrN3O2/c1-3-25-18-9-8-14(20)11-15(18)19(24)23-22-12(2)17-10-13-6-4-5-7-16(13)21-17/h4-11,21H,3H2,1-2H3,(H,23,24)
n/an/a 63n/an/an/an/an/an/a
Simon Fraser University
Curated by ChEMBL
Assay Description
Inhibition of methicillin-resistant Staphylococcus aureus 252 pyruvate kinase by LDH assay
Bioorg Med Chem 20: 7069-82 (2012)
Article DOI: 10.1016/j.bmc.2012.10.002
BindingDB Entry DOI: 10.7270/Q2NZ88ST