BDBM50402629 CHEMBL2206720
SMILES: CC(=NNC(=O)c1cc(Br)ccc1O)c1cc2cc(F)c(F)cc2n1C
InChI Key: InChIKey=ZOMDSAJIKIWXCD-UHFFFAOYSA-N
Data: 1 IC50
Activity Spreadsheet -- Enzyme Inhibition Constant Data from BindingDB
Found 1 hit for monomerid = 50402629
Trg + Lig
Ki
nM
ΔG°
kcal/mole
IC50
nM
Kd
nM
EC50/IC50
nM
koff
s-1
kon
M-1s-1
pHTemp
°C
Pyruvate kinase
(Staphylococcus aureus (strain MRSA252))
BDBM50402629
(CHEMBL2206720)
Show SMILES CC(=NNC(=O)c1cc(Br)ccc1O)c1cc2cc(F)c(F)cc2n1C |w:2.2|
Show InChI InChI=1S/C18H14BrF2N3O2/c1-9(22-23-18(26)12-7-11(19)3-4-17(12)25)15-6-10-5-13(20)14(21)8-16(10)24(15)2/h3-8,25H,1-2H3,(H,23,26)
n/an/a 61n/an/an/an/an/an/a
Simon Fraser University
Curated by ChEMBL
Assay Description
Inhibition of methicillin-resistant Staphylococcus aureus 252 pyruvate kinase by LDH assay
Bioorg Med Chem 20: 7069-82 (2012)
Article DOI: 10.1016/j.bmc.2012.10.002
BindingDB Entry DOI: 10.7270/Q2NZ88ST