BDBM50402636 CHEMBL2206712
SMILES: CC(=NNC(=O)c1cc(Br)ccc1O)c1cc2c(F)c(F)c(F)cc2[nH]1
InChI Key: InChIKey=OUUWGDMZZBFLFR-UHFFFAOYSA-N
Data: 1 IC50
Activity Spreadsheet -- Enzyme Inhibition Constant Data from BindingDB
Found 1 hit for monomerid = 50402636
Trg + Lig
Ki
nM
ΔG°
kcal/mole
IC50
nM
Kd
nM
EC50/IC50
nM
koff
s-1
kon
M-1s-1
pHTemp
°C
Pyruvate kinase
(Staphylococcus aureus (strain MRSA252))
BDBM50402636
(CHEMBL2206712)
Show SMILES CC(=NNC(=O)c1cc(Br)ccc1O)c1cc2c(F)c(F)c(F)cc2[nH]1 |w:2.2|
Show InChI InChI=1S/C17H11BrF3N3O2/c1-7(23-24-17(26)10-4-8(18)2-3-14(10)25)12-5-9-13(22-12)6-11(19)16(21)15(9)20/h2-6,22,25H,1H3,(H,24,26)
n/an/a 15n/an/an/an/an/an/a
Simon Fraser University
Curated by ChEMBL
Assay Description
Inhibition of methicillin-resistant Staphylococcus aureus 252 pyruvate kinase by LDH assay
Bioorg Med Chem 20: 7069-82 (2012)
Article DOI: 10.1016/j.bmc.2012.10.002
BindingDB Entry DOI: 10.7270/Q2NZ88ST