BDBM50402728 CHEMBL2207787
SMILES: CCCCN(C(=O)c1cccnc1)c1nnc(s1)-c1ccc(CN2CC(C2)C(O)=O)cc1
InChI Key: InChIKey=DVXYNNFOFRJRHX-UHFFFAOYSA-N
Data: 1 EC50
Activity Spreadsheet -- Enzyme Inhibition Constant Data from BindingDB
Found 1 hit for monomerid = 50402728
Trg + Lig
Ki
nM
ΔG°
kcal/mole
IC50
nM
Kd
nM
EC50/IC50
nM
koff
s-1
kon
M-1s-1
pHTemp
°C
Sphingosine 1-phosphate receptor 1
(Homo sapiens (Human))
BDBM50402728
(CHEMBL2207787)
Show SMILES CCCCN(C(=O)c1cccnc1)c1nnc(s1)-c1ccc(CN2CC(C2)C(O)=O)cc1
Show InChI InChI=1S/C23H25N5O3S/c1-2-3-11-28(21(29)18-5-4-10-24-12-18)23-26-25-20(32-23)17-8-6-16(7-9-17)13-27-14-19(15-27)22(30)31/h4-10,12,19H,2-3,11,13-15H2,1H3,(H,30,31)
Reactome pathway
n/an/an/an/a 47n/an/an/an/a
Rhône-Poulenc Rorer
Curated by ChEMBL
Assay Description
Agonist activity at S1P1 receptor by [35S]GTPgammaS binding assay
Bioorg Med Chem Lett 22: 7672-6 (2012)
Article DOI: 10.1016/j.bmcl.2012.09.110
BindingDB Entry DOI: 10.7270/Q21837PP