BDBM50402733 CHEMBL2207782
SMILES: CCN(C(=O)c1ccccc1F)c1nnc(s1)-c1ccc(CN2CC(C2)C(O)=O)cc1
InChI Key: InChIKey=XWZYMSMLWMVTQS-UHFFFAOYSA-N
Data: 2 EC50
Activity Spreadsheet -- Enzyme Inhibition Constant Data from BindingDB
Found 2 hits for monomerid = 50402733
Trg + Lig
Ki
nM
ΔG°
kcal/mole
IC50
nM
Kd
nM
EC50/IC50
nM
koff
s-1
kon
M-1s-1
pHTemp
°C
Sphingosine 1-phosphate receptor 3
(Homo sapiens (Human))
BDBM50402733
(CHEMBL2207782)
Show SMILES CCN(C(=O)c1ccccc1F)c1nnc(s1)-c1ccc(CN2CC(C2)C(O)=O)cc1
Show InChI InChI=1S/C22H21FN4O3S/c1-2-27(20(28)17-5-3-4-6-18(17)23)22-25-24-19(31-22)15-9-7-14(8-10-15)11-26-12-16(13-26)21(29)30/h3-10,16H,2,11-13H2,1H3,(H,29,30)
NCI pathway
Reactome pathway
n/an/an/an/a>4.00E+4n/an/an/an/a
Rhône-Poulenc Rorer
Curated by ChEMBL
Assay Description
Agonist activity at S1P3 receptor by [35S]GTPgammaS binding assay
Bioorg Med Chem Lett 22: 7672-6 (2012)
Article DOI: 10.1016/j.bmcl.2012.09.110
BindingDB Entry DOI: 10.7270/Q21837PP
Sphingosine 1-phosphate receptor 1
(Homo sapiens (Human))
BDBM50402733
(CHEMBL2207782)
Show SMILES CCN(C(=O)c1ccccc1F)c1nnc(s1)-c1ccc(CN2CC(C2)C(O)=O)cc1
Show InChI InChI=1S/C22H21FN4O3S/c1-2-27(20(28)17-5-3-4-6-18(17)23)22-25-24-19(31-22)15-9-7-14(8-10-15)11-26-12-16(13-26)21(29)30/h3-10,16H,2,11-13H2,1H3,(H,29,30)
Reactome pathway
n/an/an/an/a 44n/an/an/an/a
Rhône-Poulenc Rorer
Curated by ChEMBL
Assay Description
Agonist activity at S1P1 receptor by [35S]GTPgammaS binding assay
Bioorg Med Chem Lett 22: 7672-6 (2012)
Article DOI: 10.1016/j.bmcl.2012.09.110
BindingDB Entry DOI: 10.7270/Q21837PP