BDBM50402735 CHEMBL2207780
SMILES: CCCCN(C(=O)c1ccccc1F)c1nnc(s1)-c1ccc(CN2CCC(CC2)C(O)=O)cc1
InChI Key: InChIKey=AUALREYQFIXVCC-UHFFFAOYSA-N
Data: 2 EC50
Activity Spreadsheet -- Enzyme Inhibition Constant Data from BindingDB
Found 2 hits for monomerid = 50402735
Trg + Lig
Ki
nM
ΔG°
kcal/mole
IC50
nM
Kd
nM
EC50/IC50
nM
koff
s-1
kon
M-1s-1
pHTemp
°C
Sphingosine 1-phosphate receptor 3
(Homo sapiens (Human))
BDBM50402735
(CHEMBL2207780)
Show SMILES CCCCN(C(=O)c1ccccc1F)c1nnc(s1)-c1ccc(CN2CCC(CC2)C(O)=O)cc1
Show InChI InChI=1S/C26H29FN4O3S/c1-2-3-14-31(24(32)21-6-4-5-7-22(21)27)26-29-28-23(35-26)19-10-8-18(9-11-19)17-30-15-12-20(13-16-30)25(33)34/h4-11,20H,2-3,12-17H2,1H3,(H,33,34)
NCI pathway
Reactome pathway
n/an/an/an/a 1.00E+3n/an/an/an/a
Rhône-Poulenc Rorer
Curated by ChEMBL
Assay Description
Agonist activity at S1P3 receptor by [35S]GTPgammaS binding assay
Bioorg Med Chem Lett 22: 7672-6 (2012)
Article DOI: 10.1016/j.bmcl.2012.09.110
BindingDB Entry DOI: 10.7270/Q21837PP
Sphingosine 1-phosphate receptor 1
(Homo sapiens (Human))
BDBM50402735
(CHEMBL2207780)
Show SMILES CCCCN(C(=O)c1ccccc1F)c1nnc(s1)-c1ccc(CN2CCC(CC2)C(O)=O)cc1
Show InChI InChI=1S/C26H29FN4O3S/c1-2-3-14-31(24(32)21-6-4-5-7-22(21)27)26-29-28-23(35-26)19-10-8-18(9-11-19)17-30-15-12-20(13-16-30)25(33)34/h4-11,20H,2-3,12-17H2,1H3,(H,33,34)
Reactome pathway
n/an/an/an/a 9n/an/an/an/a
Rhône-Poulenc Rorer
Curated by ChEMBL
Assay Description
Agonist activity at S1P1 receptor by [35S]GTPgammaS binding assay
Bioorg Med Chem Lett 22: 7672-6 (2012)
Article DOI: 10.1016/j.bmcl.2012.09.110
BindingDB Entry DOI: 10.7270/Q21837PP