BDBM50402740 CHEMBL2207775
SMILES: CCCCN(C(=O)c1ccccc1F)c1nnc(s1)-c1ccc(CCC(O)=O)cc1C
InChI Key: InChIKey=QNKHCQQCAMURIR-UHFFFAOYSA-N
Data: 1 EC50
Activity Spreadsheet -- Enzyme Inhibition Constant Data from BindingDB
Found 1 hit for monomerid = 50402740
Trg + Lig
Ki
nM
ΔG°
kcal/mole
IC50
nM
Kd
nM
EC50/IC50
nM
koff
s-1
kon
M-1s-1
pHTemp
°C
Sphingosine 1-phosphate receptor 1
(Homo sapiens (Human))
BDBM50402740
(CHEMBL2207775)
Show SMILES CCCCN(C(=O)c1ccccc1F)c1nnc(s1)-c1ccc(CCC(O)=O)cc1C
Show InChI InChI=1S/C23H24FN3O3S/c1-3-4-13-27(22(30)18-7-5-6-8-19(18)24)23-26-25-21(31-23)17-11-9-16(14-15(17)2)10-12-20(28)29/h5-9,11,14H,3-4,10,12-13H2,1-2H3,(H,28,29)
Reactome pathway
n/an/an/an/a 1.50E+3n/an/an/an/a
Rhône-Poulenc Rorer
Curated by ChEMBL
Assay Description
Agonist activity at S1P1 receptor by [35S]GTPgammaS binding assay
Bioorg Med Chem Lett 22: 7672-6 (2012)
Article DOI: 10.1016/j.bmcl.2012.09.110
BindingDB Entry DOI: 10.7270/Q21837PP