BDBM50402743 CHEMBL2207792
SMILES: CCCCN(C(=O)c1ccccc1Cl)c1nnc(s1)-c1ccc(CN2CC(C2)C(O)=O)cc1C
InChI Key: InChIKey=WJVCVGQFAYWZRC-UHFFFAOYSA-N
Data: 2 EC50
Activity Spreadsheet -- Enzyme Inhibition Constant Data from BindingDB
Found 2 hits for monomerid = 50402743
Trg + Lig
Ki
nM
ΔG°
kcal/mole
IC50
nM
Kd
nM
EC50/IC50
nM
koff
s-1
kon
M-1s-1
pHTemp
°C
Sphingosine 1-phosphate receptor 1
(Homo sapiens (Human))
BDBM50402743
(CHEMBL2207792)
Show SMILES CCCCN(C(=O)c1ccccc1Cl)c1nnc(s1)-c1ccc(CN2CC(C2)C(O)=O)cc1C
Show InChI InChI=1S/C25H27ClN4O3S/c1-3-4-11-30(23(31)20-7-5-6-8-21(20)26)25-28-27-22(34-25)19-10-9-17(12-16(19)2)13-29-14-18(15-29)24(32)33/h5-10,12,18H,3-4,11,13-15H2,1-2H3,(H,32,33)
Reactome pathway
n/an/an/an/a 1.10n/an/an/an/a
Rhône-Poulenc Rorer
Curated by ChEMBL
Assay Description
Agonist activity at S1P1 receptor by [35S]GTPgammaS binding assay
Bioorg Med Chem Lett 22: 7672-6 (2012)
Article DOI: 10.1016/j.bmcl.2012.09.110
BindingDB Entry DOI: 10.7270/Q21837PP
Sphingosine 1-phosphate receptor 3
(Homo sapiens (Human))
BDBM50402743
(CHEMBL2207792)
Show SMILES CCCCN(C(=O)c1ccccc1Cl)c1nnc(s1)-c1ccc(CN2CC(C2)C(O)=O)cc1C
Show InChI InChI=1S/C25H27ClN4O3S/c1-3-4-11-30(23(31)20-7-5-6-8-21(20)26)25-28-27-22(34-25)19-10-9-17(12-16(19)2)13-29-14-18(15-29)24(32)33/h5-10,12,18H,3-4,11,13-15H2,1-2H3,(H,32,33)
NCI pathway
Reactome pathway
n/an/an/an/a 950n/an/an/an/a
Rhône-Poulenc Rorer
Curated by ChEMBL
Assay Description
Agonist activity at S1P3 receptor by [35S]GTPgammaS binding assay
Bioorg Med Chem Lett 22: 7672-6 (2012)
Article DOI: 10.1016/j.bmcl.2012.09.110
BindingDB Entry DOI: 10.7270/Q21837PP