BDBM50402837 CHEMBL2204107
SMILES: CCNC(=O)c1ccc(Cc2c(C(=O)OC)n(-c3ccccc3)c3cc(Cl)ccc3c2=O)cc1
InChI Key: InChIKey=CBSFDSPVUSGETR-UHFFFAOYSA-N
Data: 2 IC50
Activity Spreadsheet -- Enzyme Inhibition Constant Data from BindingDB
Found 2 hits for monomerid = 50402837
Trg + Lig
Ki
nM
ΔG°
kcal/mole
IC50
nM
Kd
nM
EC50/IC50
nM
koff
s-1
kon
M-1s-1
pHTemp
°C
Mitogen-activated protein kinase 8
(Homo sapiens (Human))
BDBM50402837
(CHEMBL2204107)
Show SMILES CCNC(=O)c1ccc(Cc2c(C(=O)OC)n(-c3ccccc3)c3cc(Cl)ccc3c2=O)cc1
Show InChI InChI=1S/C27H23ClN2O4/c1-3-29-26(32)18-11-9-17(10-12-18)15-22-24(27(33)34-2)30(20-7-5-4-6-8-20)23-16-19(28)13-14-21(23)25(22)31/h4-14,16H,3,15H2,1-2H3,(H,29,32)
NCI pathway
Reactome pathway
n/an/a 38n/an/an/an/an/an/a
Roche Palo Alto
Curated by ChEMBL
Assay Description
Inhibition of human JNK1 alpha1 using GST-tagged ATF2 as substrate and [gamma33P]ATP incubated for 10 mins prior to substrate addition measured after...
Bioorg Med Chem Lett 22: 7381-7 (2012)
Article DOI: 10.1016/j.bmcl.2012.10.066
BindingDB Entry DOI: 10.7270/Q27S7PZ6
Mitogen-activated protein kinase 9
(Homo sapiens (Human))
BDBM50402837
(CHEMBL2204107)
Show SMILES CCNC(=O)c1ccc(Cc2c(C(=O)OC)n(-c3ccccc3)c3cc(Cl)ccc3c2=O)cc1
Show InChI InChI=1S/C27H23ClN2O4/c1-3-29-26(32)18-11-9-17(10-12-18)15-22-24(27(33)34-2)30(20-7-5-4-6-8-20)23-16-19(28)13-14-21(23)25(22)31/h4-14,16H,3,15H2,1-2H3,(H,29,32)
NCI pathway
Reactome pathway
n/an/a 94n/an/an/an/an/an/a
Roche Palo Alto
Curated by ChEMBL
Assay Description
Inhibition of human JNK2 alpha2 using GST-tagged ATF2 as substrate and [gamma33P]ATP incubated for 10 mins prior to substrate addition measured after...
Bioorg Med Chem Lett 22: 7381-7 (2012)
Article DOI: 10.1016/j.bmcl.2012.10.066
BindingDB Entry DOI: 10.7270/Q27S7PZ6