BDBM50402840 CHEMBL2204112
SMILES: COC(=O)c1c(Cc2ccc(cc2)C(=O)NCCO)c(=O)c2ccc(C)nc2n1-c1ccccc1
InChI Key: InChIKey=AIPARAKSAHWEMY-UHFFFAOYSA-N
Data: 2 IC50
Activity Spreadsheet -- Enzyme Inhibition Constant Data from BindingDB
Found 2 hits for monomerid = 50402840
Trg + Lig
Ki
nM
ΔG°
kcal/mole
IC50
nM
Kd
nM
EC50/IC50
nM
koff
s-1
kon
M-1s-1
pHTemp
°C
Mitogen-activated protein kinase 8
(Homo sapiens (Human))
BDBM50402840
(CHEMBL2204112)
Show SMILES COC(=O)c1c(Cc2ccc(cc2)C(=O)NCCO)c(=O)c2ccc(C)nc2n1-c1ccccc1
Show InChI InChI=1S/C27H25N3O5/c1-17-8-13-21-24(32)22(16-18-9-11-19(12-10-18)26(33)28-14-15-31)23(27(34)35-2)30(25(21)29-17)20-6-4-3-5-7-20/h3-13,31H,14-16H2,1-2H3,(H,28,33)
NCI pathway
Reactome pathway
n/an/a 30n/an/an/an/an/an/a
Roche Palo Alto
Curated by ChEMBL
Assay Description
Inhibition of human JNK1 alpha1 using GST-tagged ATF2 as substrate and [gamma33P]ATP incubated for 10 mins prior to substrate addition measured after...
Bioorg Med Chem Lett 22: 7381-7 (2012)
Article DOI: 10.1016/j.bmcl.2012.10.066
BindingDB Entry DOI: 10.7270/Q27S7PZ6
Mitogen-activated protein kinase 9
(Homo sapiens (Human))
BDBM50402840
(CHEMBL2204112)
Show SMILES COC(=O)c1c(Cc2ccc(cc2)C(=O)NCCO)c(=O)c2ccc(C)nc2n1-c1ccccc1
Show InChI InChI=1S/C27H25N3O5/c1-17-8-13-21-24(32)22(16-18-9-11-19(12-10-18)26(33)28-14-15-31)23(27(34)35-2)30(25(21)29-17)20-6-4-3-5-7-20/h3-13,31H,14-16H2,1-2H3,(H,28,33)
NCI pathway
Reactome pathway
n/an/a 64n/an/an/an/an/an/a
Roche Palo Alto
Curated by ChEMBL
Assay Description
Inhibition of human JNK2 alpha2 using GST-tagged ATF2 as substrate and [gamma33P]ATP incubated for 10 mins prior to substrate addition measured after...
Bioorg Med Chem Lett 22: 7381-7 (2012)
Article DOI: 10.1016/j.bmcl.2012.10.066
BindingDB Entry DOI: 10.7270/Q27S7PZ6