BDBM50402867 CHEMBL2205589
SMILES: COC1CN(C1)C(=O)c1c(NC(=O)c2ccccc2OC(F)(F)F)sc2COCCc12
InChI Key: InChIKey=ODIBENRIUVELIZ-UHFFFAOYSA-N
Data: 2 EC50
Activity Spreadsheet -- Enzyme Inhibition Constant Data from BindingDB
Found 2 hits for monomerid = 50402867
Trg + Lig
Ki
nM
ΔG°
kcal/mole
IC50
nM
Kd
nM
EC50/IC50
nM
koff
s-1
kon
M-1s-1
pHTemp
°C
Cannabinoid receptor 1
(Homo sapiens (Human))
BDBM50402867
(CHEMBL2205589)
Show SMILES COC1CN(C1)C(=O)c1c(NC(=O)c2ccccc2OC(F)(F)F)sc2COCCc12
Show InChI InChI=1S/C20H19F3N2O5S/c1-28-11-8-25(9-11)19(27)16-13-6-7-29-10-15(13)31-18(16)24-17(26)12-4-2-3-5-14(12)30-20(21,22)23/h2-5,11H,6-10H2,1H3,(H,24,26)
NCI pathway
Reactome pathway
n/an/an/an/a 1.42E+3n/an/an/an/a
Nycomed Pharma Pvt. Ltd
Curated by ChEMBL
Assay Description
Agonist activity at human CB1 receptor after 4 hrs by luciferase reporter gene assay
Bioorg Med Chem Lett 22: 7314-21 (2012)
Article DOI: 10.1016/j.bmcl.2012.10.087
BindingDB Entry DOI: 10.7270/Q2QR4Z9V
Cannabinoid receptor 2
(Homo sapiens (Human))
BDBM50402867
(CHEMBL2205589)
Show SMILES COC1CN(C1)C(=O)c1c(NC(=O)c2ccccc2OC(F)(F)F)sc2COCCc12
Show InChI InChI=1S/C20H19F3N2O5S/c1-28-11-8-25(9-11)19(27)16-13-6-7-29-10-15(13)31-18(16)24-17(26)12-4-2-3-5-14(12)30-20(21,22)23/h2-5,11H,6-10H2,1H3,(H,24,26)
Reactome pathway
n/an/an/an/a 38n/an/an/an/a
Nycomed Pharma Pvt. Ltd
Curated by ChEMBL
Assay Description
Agonist activity at human CB2 receptor after 4 hrs by luciferase reporter gene assay
Bioorg Med Chem Lett 22: 7314-21 (2012)
Article DOI: 10.1016/j.bmcl.2012.10.087
BindingDB Entry DOI: 10.7270/Q2QR4Z9V