BDBM50403091 CHEMBL2216872
SMILES: COc1ccc(NC(=O)c2c(C)oc3ncn(CC(C)C)c(=O)c23)cc1
InChI Key: InChIKey=XTZYDJFXBJTGSY-UHFFFAOYSA-N
Data: 1 IC50
Activity Spreadsheet -- Enzyme Inhibition Constant Data from BindingDB
Found 1 hit for monomerid = 50403091
Trg + Lig
Ki
nM
ΔG°
kcal/mole
IC50
nM
Kd
nM
EC50/IC50
nM
koff
s-1
kon
M-1s-1
pHTemp
°C
Phosphatidylinositol 4,5-bisphosphate 3-kinase catalytic subunit delta isoform
(Homo sapiens (Human))
BDBM50403091
(CHEMBL2216872)
Show SMILES COc1ccc(NC(=O)c2c(C)oc3ncn(CC(C)C)c(=O)c23)cc1
Show InChI InChI=1S/C19H21N3O4/c1-11(2)9-22-10-20-18-16(19(22)24)15(12(3)26-18)17(23)21-13-5-7-14(25-4)8-6-13/h5-8,10-11H,9H2,1-4H3,(H,21,23)
NCI pathway
Reactome pathway
n/an/a 5.90n/an/an/an/an/an/a
Amgen Inc.
Curated by ChEMBL
Assay Description
Inhibition of PI3Kdelta
J Med Chem 55: 8559-81 (2012)
Article DOI: 10.1021/jm300847w
BindingDB Entry DOI: 10.7270/Q2SN0B47