BDBM50403104 CHEMBL2216904
SMILES: COc1cc2CCN(C)[C@H](Cc3ccc(O)c(Oc4ccc(C[C@H]5N(C)CCc6cc(OC)c(OC)cc56)cc4)c3)c2cc1O
InChI Key: InChIKey=BURJAQFYNVMZDV-FIRIVFDPSA-N
Data: 3 IC50
Activity Spreadsheet -- Enzyme Inhibition Constant Data from BindingDB
Found 3 hits for monomerid = 50403104
Trg + Lig
Ki
nM
ΔG°
kcal/mole
IC50
nM
Kd
nM
EC50/IC50
nM
koff
s-1
kon
M-1s-1
pHTemp
°C
Potassium voltage-gated channel subfamily H member 2
(Homo sapiens (Human))
BDBM50403104
(CHEMBL2216904)
Show SMILES COc1cc2CCN(C)[C@H](Cc3ccc(O)c(Oc4ccc(C[C@H]5N(C)CCc6cc(OC)c(OC)cc56)cc4)c3)c2cc1O |r|
Show InChI InChI=1S/C37H42N2O6/c1-38-15-13-26-20-36(43-4)37(44-5)22-29(26)30(38)16-23-6-9-27(10-7-23)45-35-18-24(8-11-32(35)40)17-31-28-21-33(41)34(42-3)19-25(28)12-14-39(31)2/h6-11,18-22,30-31,40-41H,12-17H2,1-5H3/t30-,31-/m1/s1
Reactome pathway
n/an/a 9.60E+3n/an/an/an/an/an/a
Huazhong University of Science and Technology
Curated by ChEMBL
Assay Description
Inhibition of human ERG tail current expressed in HEK293 cells at + 60 mV holding potential by patch clamp assay
J Nat Prod 75: 1539-45 (2012)
Article DOI: 10.1021/np300232b
BindingDB Entry DOI: 10.7270/Q2NV9KFD
Potassium voltage-gated channel subfamily E member 1
(Oryctolagus cuniculus)
BDBM50403104
(CHEMBL2216904)
Show SMILES COc1cc2CCN(C)[C@H](Cc3ccc(O)c(Oc4ccc(C[C@H]5N(C)CCc6cc(OC)c(OC)cc56)cc4)c3)c2cc1O |r|
Show InChI InChI=1S/C37H42N2O6/c1-38-15-13-26-20-36(43-4)37(44-5)22-29(26)30(38)16-23-6-9-27(10-7-23)45-35-18-24(8-11-32(35)40)17-31-28-21-33(41)34(42-3)19-25(28)12-14-39(31)2/h6-11,18-22,30-31,40-41H,12-17H2,1-5H3/t30-,31-/m1/s1
n/an/a 5.25E+4n/an/an/an/an/an/a
Huazhong University of Science and Technology
Curated by ChEMBL
Assay Description
Inhibition of Iks tail cuurent in rabbit ventricular myocytes
J Nat Prod 75: 1539-45 (2012)
Article DOI: 10.1021/np300232b
BindingDB Entry DOI: 10.7270/Q2NV9KFD
Potassium voltage-gated channel subfamily H member 2
(Homo sapiens (Human))
BDBM50403104
(CHEMBL2216904)
Show SMILES COc1cc2CCN(C)[C@H](Cc3ccc(O)c(Oc4ccc(C[C@H]5N(C)CCc6cc(OC)c(OC)cc56)cc4)c3)c2cc1O |r|
Show InChI InChI=1S/C37H42N2O6/c1-38-15-13-26-20-36(43-4)37(44-5)22-29(26)30(38)16-23-6-9-27(10-7-23)45-35-18-24(8-11-32(35)40)17-31-28-21-33(41)34(42-3)19-25(28)12-14-39(31)2/h6-11,18-22,30-31,40-41H,12-17H2,1-5H3/t30-,31-/m1/s1
Reactome pathway
n/an/a 9.10E+3n/an/an/an/an/an/a
Huazhong University of Science and Technology
Curated by ChEMBL
Assay Description
Inhibition of human ERG stepped current expressed in HEK293 cells at + 20 mV holding potential by patch clamp assay
J Nat Prod 75: 1539-45 (2012)
Article DOI: 10.1021/np300232b
BindingDB Entry DOI: 10.7270/Q2NV9KFD