BDBM50403678 CHEMBL87583
SMILES: FC(F)(F)c1cccc(c1)-c1ncc(CCNC2CC2)[nH]1
InChI Key: InChIKey=CIXJCCIPLDBDFN-UHFFFAOYSA-N
Data: 1 Kd
Activity Spreadsheet -- Enzyme Inhibition Constant Data from BindingDB
Found 1 hit for monomerid = 50403678
Trg + Lig
Ki
nM
ΔG°
kcal/mole
IC50
nM
Kd
nM
EC50/IC50
nM
koff
s-1
kon
M-1s-1
pHTemp
°C
Histamine H1 receptor
(Cavia porcellus (domestic guinea pig))
BDBM50403678
(CHEMBL87583)
Show SMILES FC(F)(F)c1cccc(c1)-c1ncc(CCNC2CC2)[nH]1
Show InChI InChI=1S/C15H16F3N3/c16-15(17,18)11-3-1-2-10(8-11)14-20-9-13(21-14)6-7-19-12-4-5-12/h1-3,8-9,12,19H,4-7H2,(H,20,21)
n/an/an/a 0.741n/an/an/an/an/a
Freie Universit£t Berlin
Curated by ChEMBL
Assay Description
Contractile effects antagonized by mepyramine (0.3-100 nM) against Histamine H1 receptor in guinea pig ileum
Bioorg Med Chem Lett 8: 2583-8 (1999)
BindingDB Entry DOI: 10.7270/Q2G1621V