BDBM50403814 CHEMBL3038227
SMILES: [H][C@@]12[#6]-[#6]-[#6]-[#7]1-[#6](=O)-[#6@@H](-[#6]-[#6]-[#6]-[#6]-[#7])-[#7]-[#6](=O)-[#6@H](-[#6]-[#6]-[#6]-[#6]-[#7])-[#7]-[#6](=O)-[#6@H](-[#6]-[#6]-[#6]\[#7]=[#6](/[#7])-[#7])-[#7]-[#6](=O)-[#6@H](-[#6]-c1ccc(-[#8])cc1)-[#7]-[#6](=O)-[#6@H](-[#6]-[#16]-[#16]-[#6]-[#6@H](-[#7]-[#6](=O)-[#6@H](-[#6]-[#6]-[#6]-[#7]-[#6](-[#7])=O)-[#7]-[#6](=O)-[#6@H](-[#6]-[#6]-[#6]\[#7]=[#6](\[#7])-[#7])-[#7]-[#6](=O)-[#6@H](-[#6]-c1ccc(-[#8])cc1)-[#7]-[#6]2=O)-[#6](=O)-[#7]-[#6@@H](-[#6]-[#6]-[#6]\[#7]=[#6](\[#7])-[#7])-[#6](-[#8])=O)-[#7]-[#6](=O)-[#6@H](-[#6]-c1ccc2ccccc2c1)-[#7]-[#6](=O)-[#6@H](-[#6]-[#6]-[#6]\[#7]=[#6](\[#7])-[#7])-[#7]-[#6](=O)-[#6](-[#6])-[#7]
InChI Key: InChIKey=SMWFVYGXNYUMEG-VWPQHCFXSA-N
Data: 1 EC50
Activity Spreadsheet -- Enzyme Inhibition Constant Data from BindingDB
Found 1 hit for monomerid = 50403814
Trg + Lig
Ki
nM
ΔG°
kcal/mole
IC50
nM
Kd
nM
EC50/IC50
nM
koff
s-1
kon
M-1s-1
pHTemp
°C
C-X-C chemokine receptor type 4 (CXCR4)
(Homo sapiens (Human))
BDBM50403814
(CHEMBL3038227)
Show SMILES [H][C@@]12[#6]-[#6]-[#6]-[#7]1-[#6](=O)-[#6@@H](-[#6]-[#6]-[#6]-[#6]-[#7])-[#7]-[#6](=O)-[#6@H](-[#6]-[#6]-[#6]-[#6]-[#7])-[#7]-[#6](=O)-[#6@H](-[#6]-[#6]-[#6]\[#7]=[#6](/[#7])-[#7])-[#7]-[#6](=O)-[#6@H](-[#6]-c1ccc(-[#8])cc1)-[#7]-[#6](=O)-[#6@H](-[#6]-[#16]-[#16]-[#6]-[#6@H](-[#7]-[#6](=O)-[#6@H](-[#6]-[#6]-[#6]-[#7]-[#6](-[#7])=O)-[#7]-[#6](=O)-[#6@H](-[#6]-[#6]-[#6]\[#7]=[#6](\[#7])-[#7])-[#7]-[#6](=O)-[#6@H](-[#6]-c1ccc(-[#8])cc1)-[#7]-[#6]2=O)-[#6](=O)-[#7]-[#6@@H](-[#6]-[#6]-[#6]\[#7]=[#6](\[#7])-[#7])-[#6](-[#8])=O)-[#7]-[#6](=O)-[#6@H](-[#6]-c1ccc2ccccc2c1)-[#7]-[#6](=O)-[#6@H](-[#6]-[#6]-[#6]\[#7]=[#6](\[#7])-[#7])-[#7]-[#6](=O)-[#6](-[#6])-[#7]
Show InChI InChI=1S/C87H134N30O18S2/c1-48(90)69(120)105-57(18-8-36-100-83(91)92)73(124)112-65(45-51-24-29-52-14-2-3-15-53(52)42-51)77(128)116-67-47-137-136-46-66(78(129)111-62(82(133)134)22-12-39-103-86(97)98)115-74(125)60(21-11-40-104-87(99)135)107-71(122)59(20-10-38-102-85(95)96)109-76(127)64(44-50-27-32-55(119)33-28-50)114-80(131)68-23-13-41-117(68)81(132)61(17-5-7-35-89)110-72(123)56(16-4-6-34-88)106-70(121)58(19-9-37-101-84(93)94)108-75(126)63(113-79(67)130)43-49-25-30-54(118)31-26-49/h2-3,14-15,24-33,42,48,56-68,118-119H,4-13,16-23,34-41,43-47,88-90H2,1H3,(H,105,120)(H,106,121)(H,107,122)(H,108,126)(H,109,127)(H,110,123)(H,111,129)(H,112,124)(H,113,130)(H,114,131)(H,115,125)(H,116,128)(H,133,134)(H4,91,92,100)(H4,93,94,101)(H4,95,96,102)(H4,97,98,103)(H3,99,104,135)/t48?,56-,57-,58-,59-,60-,61+,62-,63-,64-,65-,66-,67-,68-/m0/s1
n/an/an/an/a 56n/an/an/an/a
Kyoto University
Curated by ChEMBL
Assay Description
Inhibition of HIV-induced cytopathogenicity in MT-4 cell
Bioorg Med Chem Lett 10: 2633-7 (2000)
BindingDB Entry DOI: 10.7270/Q2988866