BDBM50404071 CHEMBL128634
SMILES: [O-][N+](=O)c1cccc(c1)-c1ccc(OCC(CCc2ccncc2)N2C(=O)CCCC2=O)cc1
InChI Key: InChIKey=AEUWFKJIAOJSNW-UHFFFAOYSA-N
Data: 1 Kd
Activity Spreadsheet -- Enzyme Inhibition Constant Data from BindingDB
Found 1 hit for monomerid = 50404071
Trg + Lig
Ki
nM
ΔG°
kcal/mole
IC50
nM
Kd
nM
EC50/IC50
nM
koff
s-1
kon
M-1s-1
pHTemp
°C
P2X purinoceptor 7
(Homo sapiens (Human))
BDBM50404071
(CHEMBL128634)
Show SMILES [O-][N+](=O)c1cccc(c1)-c1ccc(OCC(CCc2ccncc2)N2C(=O)CCCC2=O)cc1
Show InChI InChI=1S/C26H25N3O5/c30-25-5-2-6-26(31)28(25)23(10-7-19-13-15-27-16-14-19)18-34-24-11-8-20(9-12-24)21-3-1-4-22(17-21)29(32)33/h1,3-4,8-9,11-17,23H,2,5-7,10,18H2
n/an/an/a 31.6n/an/an/an/an/a
AstraZeneca
Curated by ChEMBL
Assay Description
Antagonist activity at P2X7 receptor in human THP1 cells assessed as inhibition of BzATP-induced ethidium uptake
J Med Chem 52: 3123-41 (2009)
Article DOI: 10.1021/jm801528x
BindingDB Entry DOI: 10.7270/Q2251KDR