BDBM50404072 AZ-11645373::CHEMBL335550
SMILES: [O-][N+](=O)c1cccc(c1)-c1ccc(OCC(CCc2ccncc2)N2C(=O)CCC2=O)cc1
InChI Key: InChIKey=JANZXFNVGRNHEL-UHFFFAOYSA-N
Data: 1 Kd
Activity Spreadsheet -- Enzyme Inhibition Constant Data from BindingDB
Found 1 hit for monomerid = 50404072
Trg + Lig
Ki
nM
ΔG°
kcal/mole
IC50
nM
Kd
nM
EC50/IC50
nM
koff
s-1
kon
M-1s-1
pHTemp
°C
P2X purinoceptor 7
(Homo sapiens (Human))
BDBM50404072
(AZ-11645373 | CHEMBL335550)
Show SMILES [O-][N+](=O)c1cccc(c1)-c1ccc(OCC(CCc2ccncc2)N2C(=O)CCC2=O)cc1
Show InChI InChI=1S/C25H23N3O5/c29-24-10-11-25(30)27(24)22(7-4-18-12-14-26-15-13-18)17-33-23-8-5-19(6-9-23)20-2-1-3-21(16-20)28(31)32/h1-3,5-6,8-9,12-16,22H,4,7,10-11,17H2
n/an/an/a 126n/an/an/an/an/a
AstraZeneca
Curated by ChEMBL
Assay Description
Antagonist activity at P2X7 receptor in human THP1 cells assessed as inhibition of BzATP-induced ethidium uptake
J Med Chem 52: 3123-41 (2009)
Article DOI: 10.1021/jm801528x
BindingDB Entry DOI: 10.7270/Q2251KDR