BDBM50404077 CHEMBL340983
SMILES: COc1ccc(Cl)c(c1)C(=O)NCC12CC3CC(CC(C3)C1)C2
InChI Key: InChIKey=FVGVYAMTXQUAFY-UHFFFAOYSA-N
Data: 1 Kd
Activity Spreadsheet -- Enzyme Inhibition Constant Data from BindingDB
Found 1 hit for monomerid = 50404077
Trg + Lig
Ki
nM
ΔG°
kcal/mole
IC50
nM
Kd
nM
EC50/IC50
nM
koff
s-1
kon
M-1s-1
pHTemp
°C
P2X purinoceptor 7
(Homo sapiens (Human))
BDBM50404077
(CHEMBL340983)
Show SMILES COc1ccc(Cl)c(c1)C(=O)NCC12CC3CC(CC(C3)C1)C2 |TLB:12:13:16:20.19.18,THB:14:15:18:22.13.21,14:13:16.15.20:18,21:13:16:20.19.18,21:19:16:22.14.13|
Show InChI InChI=1S/C19H24ClNO2/c1-23-15-2-3-17(20)16(7-15)18(22)21-11-19-8-12-4-13(9-19)6-14(5-12)10-19/h2-3,7,12-14H,4-6,8-11H2,1H3,(H,21,22)
n/an/an/a 1.58n/an/an/an/an/a
AstraZeneca
Curated by ChEMBL
Assay Description
Antagonist activity at P2X7 receptor in human THP1 cells assessed as inhibition of BzATP-induced ethidium uptake
J Med Chem 52: 3123-41 (2009)
Article DOI: 10.1021/jm801528x
BindingDB Entry DOI: 10.7270/Q2251KDR