BDBM50404086 CHEMBL341226
SMILES: COc1cccc(NC(=O)CC23CC4CC(CC(C4)C2)C3)c1C
InChI Key: InChIKey=HMFZJPXGIJLMTJ-UHFFFAOYSA-N
Data: 1 IC50  1 Kd
Activity Spreadsheet -- Enzyme Inhibition Constant Data from BindingDB
Found 2 hits for monomerid = 50404086
Trg + Lig
Ki
nM
ΔG°
kcal/mole
IC50
nM
Kd
nM
EC50/IC50
nM
koff
s-1
kon
M-1s-1
pHTemp
°C
P2X purinoceptor 7
(Homo sapiens (Human))
BDBM50404086
(CHEMBL341226)
Show SMILES COc1cccc(NC(=O)CC23CC4CC(CC(C4)C2)C3)c1C |TLB:20:11:18:15.14.16,THB:19:11:14:17.18.16,19:17:11.12.20:14,20:15:11.12.19:18|
Show InChI InChI=1S/C20H27NO2/c1-13-17(4-3-5-18(13)23-2)21-19(22)12-20-9-14-6-15(10-20)8-16(7-14)11-20/h3-5,14-16H,6-12H2,1-2H3,(H,21,22)
n/an/a 5n/an/an/an/an/an/a
Punjabi University
Curated by ChEMBL
Assay Description
Antagonist activity at P2X7 receptor (unknown origin)
Bioorg Med Chem 22: 54-88 (2014)
Article DOI: 10.1016/j.bmc.2013.10.054
BindingDB Entry DOI: 10.7270/Q27M0BX7
P2X purinoceptor 7
(Homo sapiens (Human))
BDBM50404086
(CHEMBL341226)
Show SMILES COc1cccc(NC(=O)CC23CC4CC(CC(C4)C2)C3)c1C |TLB:20:11:18:15.14.16,THB:19:11:14:17.18.16,19:17:11.12.20:14,20:15:11.12.19:18|
Show InChI InChI=1S/C20H27NO2/c1-13-17(4-3-5-18(13)23-2)21-19(22)12-20-9-14-6-15(10-20)8-16(7-14)11-20/h3-5,14-16H,6-12H2,1-2H3,(H,21,22)
n/an/an/a 5.01n/an/an/an/an/a
AstraZeneca
Curated by ChEMBL
Assay Description
Antagonist activity at P2X7 receptor in human THP1 cells assessed as inhibition of BzATP-induced ethidium uptake
J Med Chem 52: 3123-41 (2009)
Article DOI: 10.1021/jm801528x
BindingDB Entry DOI: 10.7270/Q2251KDR