BDBM50404091 CHEMBL441479
SMILES: Clc1cccc(C(=O)NCC23CC4CC(CC(C4)C2)C3)c1Cl
InChI Key: InChIKey=OFGFKUJAQALHEW-UHFFFAOYSA-N
Data: 3 IC50  1 Kd
Activity Spreadsheet -- Enzyme Inhibition Constant Data from BindingDB
Found 4 hits for monomerid = 50404091
Trg + Lig
Ki
nM
ΔG°
kcal/mole
IC50
nM
Kd
nM
EC50/IC50
nM
koff
s-1
kon
M-1s-1
pHTemp
°C
P2X purinoceptor 7
(Homo sapiens (Human))
BDBM50404091
(CHEMBL441479)
Show SMILES Clc1cccc(C(=O)NCC23CC4CC(CC(C4)C2)C3)c1Cl |TLB:13:14:18:12.11.17,17:12:19:16.18.15,17:16:19:12.11.13,THB:13:12:18:14.19.15|
Show InChI InChI=1S/C18H21Cl2NO/c19-15-3-1-2-14(16(15)20)17(22)21-10-18-7-11-4-12(8-18)6-13(5-11)9-18/h1-3,11-13H,4-10H2,(H,21,22)
n/an/a 65n/an/an/an/an/an/a
Abbott Laboratories
Curated by ChEMBL
Assay Description
Antagonist activity at human recombinant P2X7 receptor
Bioorg Med Chem Lett 17: 4044-8 (2007)
Article DOI: 10.1016/j.bmcl.2007.04.075
BindingDB Entry DOI: 10.7270/Q22F7PRH
P2X purinoceptor 7
(Homo sapiens (Human))
BDBM50404091
(CHEMBL441479)
Show SMILES Clc1cccc(C(=O)NCC23CC4CC(CC(C4)C2)C3)c1Cl |TLB:13:14:18:12.11.17,17:12:19:16.18.15,17:16:19:12.11.13,THB:13:12:18:14.19.15|
Show InChI InChI=1S/C18H21Cl2NO/c19-15-3-1-2-14(16(15)20)17(22)21-10-18-7-11-4-12(8-18)6-13(5-11)9-18/h1-3,11-13H,4-10H2,(H,21,22)
n/an/an/a 1.58n/an/an/an/an/a
AstraZeneca
Curated by ChEMBL
Assay Description
Antagonist activity at P2X7 receptor in human THP1 cells assessed as inhibition of BzATP-induced ethidium uptake
J Med Chem 52: 3123-41 (2009)
Article DOI: 10.1021/jm801528x
BindingDB Entry DOI: 10.7270/Q2251KDR
P2X purinoceptor 7
(Homo sapiens (Human))
BDBM50404091
(CHEMBL441479)
Show SMILES Clc1cccc(C(=O)NCC23CC4CC(CC(C4)C2)C3)c1Cl |TLB:13:14:18:12.11.17,17:12:19:16.18.15,17:16:19:12.11.13,THB:13:12:18:14.19.15|
Show InChI InChI=1S/C18H21Cl2NO/c19-15-3-1-2-14(16(15)20)17(22)21-10-18-7-11-4-12(8-18)6-13(5-11)9-18/h1-3,11-13H,4-10H2,(H,21,22)
n/an/a 63.1n/an/an/an/an/an/a
Abbott Laboratories
Curated by ChEMBL
Assay Description
Antagonist activity at human P2X7 receptor expressed in human 1321N1 cells assessed as inhibition of calcium flux by FLIPR
J Med Chem 49: 3659-66 (2006)
Article DOI: 10.1021/jm051202e
BindingDB Entry DOI: 10.7270/Q2VD70P4
P2X purinoceptor 7 (P2X7)
(Rattus norvegicus (Rat))
BDBM50404091
(CHEMBL441479)
Show SMILES Clc1cccc(C(=O)NCC23CC4CC(CC(C4)C2)C3)c1Cl |TLB:13:14:18:12.11.17,17:12:19:16.18.15,17:16:19:12.11.13,THB:13:12:18:14.19.15|
Show InChI InChI=1S/C18H21Cl2NO/c19-15-3-1-2-14(16(15)20)17(22)21-10-18-7-11-4-12(8-18)6-13(5-11)9-18/h1-3,11-13H,4-10H2,(H,21,22)
n/an/a 813n/an/an/an/an/an/a
Abbott Laboratories
Curated by ChEMBL
Assay Description
Antagonist activity at rat recombinant P2X7 receptor
Bioorg Med Chem Lett 17: 4044-8 (2007)
Article DOI: 10.1016/j.bmcl.2007.04.075
BindingDB Entry DOI: 10.7270/Q22F7PRH