BDBM50404285 CHEMBL8025
SMILES: FC(F)(F)c1ccc(c(c1)C(Cn1ccnc1)NC(Nc1ccc(Cl)cc1Cl)=NC#N)C(F)(F)F
InChI Key: InChIKey=QTGGFCDESWTBBI-UHFFFAOYSA-N
Data: 2 IC50
Activity Spreadsheet -- Enzyme Inhibition Constant Data from BindingDB
Found 2 hits for monomerid = 50404285
Trg + Lig
Ki
nM
ΔG°
kcal/mole
IC50
nM
Kd
nM
EC50/IC50
nM
koff
s-1
kon
M-1s-1
pHTemp
°C
Mitochondrial complex V; ATP synthase
(Bos taurus)
BDBM50404285
(CHEMBL8025)
Show SMILES FC(F)(F)c1ccc(c(c1)C(Cn1ccnc1)NC(Nc1ccc(Cl)cc1Cl)=NC#N)C(F)(F)F |w:28.31|
Show InChI InChI=1S/C21H14Cl2F6N6/c22-13-2-4-17(16(23)8-13)33-19(32-10-30)34-18(9-35-6-5-31-11-35)14-7-12(20(24,25)26)1-3-15(14)21(27,28)29/h1-8,11,18H,9H2,(H2,32,33,34)
n/an/a>1.00E+5n/an/an/an/an/an/a
Pharmaceutical Research Institute
Curated by ChEMBL
Assay Description
Inhibitory activity against bovine mitochondrial F1F0-ATP synthase
Bioorg Med Chem Lett 14: 1027-30 (2004)
Article DOI: 10.1016/j.bmcl.2003.11.077
BindingDB Entry DOI: 10.7270/Q2VX0HQ9
Mitochondrial complex V; ATP synthase
(Bos taurus)
BDBM50404285
(CHEMBL8025)
Show SMILES FC(F)(F)c1ccc(c(c1)C(Cn1ccnc1)NC(Nc1ccc(Cl)cc1Cl)=NC#N)C(F)(F)F |w:28.31|
Show InChI InChI=1S/C21H14Cl2F6N6/c22-13-2-4-17(16(23)8-13)33-19(32-10-30)34-18(9-35-6-5-31-11-35)14-7-12(20(24,25)26)1-3-15(14)21(27,28)29/h1-8,11,18H,9H2,(H2,32,33,34)
n/an/a 710n/an/an/an/an/an/a
Pharmaceutical Research Institute
Curated by ChEMBL
Assay Description
Inhibitory activity against bovine mitochondrial F1F0 ATP hydrolase
Bioorg Med Chem Lett 14: 1027-30 (2004)
Article DOI: 10.1016/j.bmcl.2003.11.077
BindingDB Entry DOI: 10.7270/Q2VX0HQ9