BDBM50404293 CHEMBL8024
SMILES: OC(C(Nc1ccc(Cl)cc1)=NC(Cn1ccnc1)c1ccc(Cl)cc1Cl)c1ccc(Cl)cc1
InChI Key: InChIKey=GSDABASGAUQZSX-UHFFFAOYSA-N
Data: 2 IC50
Activity Spreadsheet -- Enzyme Inhibition Constant Data from BindingDB
Found 2 hits for monomerid = 50404293
Trg + Lig
Ki
nM
ΔG°
kcal/mole
IC50
nM
Kd
nM
EC50/IC50
nM
koff
s-1
kon
M-1s-1
pHTemp
°C
Mitochondrial complex V; ATP synthase
(Bos taurus)
BDBM50404293
(CHEMBL8024)
Show SMILES OC(C(Nc1ccc(Cl)cc1)=NC(Cn1ccnc1)c1ccc(Cl)cc1Cl)c1ccc(Cl)cc1 |w:11.12|
Show InChI InChI=1S/C25H20Cl4N4O/c26-17-3-1-16(2-4-17)24(34)25(31-20-8-5-18(27)6-9-20)32-23(14-33-12-11-30-15-33)21-10-7-19(28)13-22(21)29/h1-13,15,23-24,34H,14H2,(H,31,32)
n/an/a>1.00E+5n/an/an/an/an/an/a
Pharmaceutical Research Institute
Curated by ChEMBL
Assay Description
Inhibitory activity against bovine mitochondrial F1F0 ATP hydrolase
Bioorg Med Chem Lett 14: 1027-30 (2004)
Article DOI: 10.1016/j.bmcl.2003.11.077
BindingDB Entry DOI: 10.7270/Q2VX0HQ9
Mitochondrial complex V; ATP synthase
(Bos taurus)
BDBM50404293
(CHEMBL8024)
Show SMILES OC(C(Nc1ccc(Cl)cc1)=NC(Cn1ccnc1)c1ccc(Cl)cc1Cl)c1ccc(Cl)cc1 |w:11.12|
Show InChI InChI=1S/C25H20Cl4N4O/c26-17-3-1-16(2-4-17)24(34)25(31-20-8-5-18(27)6-9-20)32-23(14-33-12-11-30-15-33)21-10-7-19(28)13-22(21)29/h1-13,15,23-24,34H,14H2,(H,31,32)
n/an/a 82n/an/an/an/an/an/a
Pharmaceutical Research Institute
Curated by ChEMBL
Assay Description
Inhibitory activity against bovine mitochondrial F1F0 ATP hydrolase
Bioorg Med Chem Lett 14: 1027-30 (2004)
Article DOI: 10.1016/j.bmcl.2003.11.077
BindingDB Entry DOI: 10.7270/Q2VX0HQ9