BDBM50404320 CHEMBL267942
SMILES: Fc1ccc(cc1)S(=O)(=O)N1CC(CCc2ccccc2)N(Cc2cnc[nH]2)c2ccccc2C1
InChI Key: InChIKey=YKHPFCVXIGYTRM-UHFFFAOYSA-N
Data: 2 IC50
Activity Spreadsheet -- Enzyme Inhibition Constant Data from BindingDB
Found 2 hits for monomerid = 50404320
Trg + Lig
Ki
nM
ΔG°
kcal/mole
IC50
nM
Kd
nM
EC50/IC50
nM
koff
s-1
kon
M-1s-1
pHTemp
°C
Mitochondrial complex V; ATP synthase
(Bos taurus)
BDBM50404320
(CHEMBL267942)
Show SMILES Fc1ccc(cc1)S(=O)(=O)N1CC(CCc2ccccc2)N(Cc2cnc[nH]2)c2ccccc2C1
Show InChI InChI=1S/C27H27FN4O2S/c28-23-11-14-26(15-12-23)35(33,34)31-17-22-8-4-5-9-27(22)32(18-24-16-29-20-30-24)25(19-31)13-10-21-6-2-1-3-7-21/h1-9,11-12,14-16,20,25H,10,13,17-19H2,(H,29,30)
n/an/a>3.00E+4n/an/an/an/an/an/a
Pharmaceutical Research Institute
Curated by ChEMBL
Assay Description
Inhibitory activity against bovine mitochondrial F1F0-ATP synthase
Bioorg Med Chem Lett 14: 1031-4 (2004)
Article DOI: 10.1016/j.bmcl.2003.11.052
BindingDB Entry DOI: 10.7270/Q2D50MCF
Mitochondrial complex V; ATP synthase
(Bos taurus)
BDBM50404320
(CHEMBL267942)
Show SMILES Fc1ccc(cc1)S(=O)(=O)N1CC(CCc2ccccc2)N(Cc2cnc[nH]2)c2ccccc2C1
Show InChI InChI=1S/C27H27FN4O2S/c28-23-11-14-26(15-12-23)35(33,34)31-17-22-8-4-5-9-27(22)32(18-24-16-29-20-30-24)25(19-31)13-10-21-6-2-1-3-7-21/h1-9,11-12,14-16,20,25H,10,13,17-19H2,(H,29,30)
n/an/a 221n/an/an/an/an/an/a
Pharmaceutical Research Institute
Curated by ChEMBL
Assay Description
Inhibitory activity against bovine mitochondrial F1F0-ATP synthase
Bioorg Med Chem Lett 14: 1031-4 (2004)
Article DOI: 10.1016/j.bmcl.2003.11.052
BindingDB Entry DOI: 10.7270/Q2D50MCF