BDBM50404324 CHEMBL2092985
SMILES: Fc1cc(ccc1NC(=O)c1cc(nn1-c1cc2ccccc2cc1F)C(F)(F)F)C(=N)N1CCCC1
InChI Key: InChIKey=WNEFIHZOWXDTPA-UHFFFAOYSA-N
Data: 1 IC50
Activity Spreadsheet -- Enzyme Inhibition Constant Data from BindingDB
Found 1 hit for monomerid = 50404324
Trg + Lig
Ki
nM
ΔG°
kcal/mole
IC50
nM
Kd
nM
EC50/IC50
nM
koff
s-1
kon
M-1s-1
pHTemp
°C
Coagulation factor X
(Homo sapiens (Human))
BDBM50404324
(CHEMBL2092985)
Show SMILES Fc1cc(ccc1NC(=O)c1cc(nn1-c1cc2ccccc2cc1F)C(F)(F)F)C(=N)N1CCCC1
Show InChI InChI=1S/C26H20F5N5O/c27-18-12-17(24(32)35-9-3-4-10-35)7-8-20(18)33-25(37)22-14-23(26(29,30)31)34-36(22)21-13-16-6-2-1-5-15(16)11-19(21)28/h1-2,5-8,11-14,32H,3-4,9-10H2,(H,33,37)
Reactome pathway
n/an/a 10n/an/an/an/an/an/a
Millennium Pharmaceuticals Inc.
Curated by ChEMBL
Assay Description
In vitro inhibitory activity against human coagulation factor X
Bioorg Med Chem Lett 14: 1229-34 (2004)
Article DOI: 10.1016/j.bmcl.2003.12.054
BindingDB Entry DOI: 10.7270/Q2QN6664