BDBM50404424 CHEMBL25928
SMILES: COc1ccc2ccc(cc2c1)S(=O)(=O)NC(CCCNC(N)=N)C(=O)N(CC1CCCO1)CC(O)=O
InChI Key: InChIKey=ANFUOPWETFCVBU-UHFFFAOYSA-N
Data: 1 IC50
Activity Spreadsheet -- Enzyme Inhibition Constant Data from BindingDB
Found 1 hit for monomerid = 50404424
Trg + Lig
Ki
nM
ΔG°
kcal/mole
IC50
nM
Kd
nM
EC50/IC50
nM
koff
s-1
kon
M-1s-1
pHTemp
°C
Thrombin
(Bos taurus (Bovine))
BDBM50404424
(CHEMBL25928)
Show SMILES COc1ccc2ccc(cc2c1)S(=O)(=O)NC(CCCNC(N)=N)C(=O)N(CC1CCCO1)CC(O)=O
Show InChI InChI=1S/C24H33N5O7S/c1-35-18-8-6-16-7-9-20(13-17(16)12-18)37(33,34)28-21(5-2-10-27-24(25)26)23(32)29(15-22(30)31)14-19-4-3-11-36-19/h6-9,12-13,19,21,28H,2-5,10-11,14-15H2,1H3,(H,30,31)(H4,25,26,27)
n/an/a 150n/an/an/an/an/an/a
TBA
Curated by ChEMBL
Assay Description
Concentration at which the clotting time was prolonged by twice that of the control by inhibiting thrombin
J Med Chem 23: 1293-9 (1981)
BindingDB Entry DOI: 10.7270/Q2GQ6ZX5