BDBM50404436 CHEMBL24318
SMILES: COCCN(CC(O)=O)C(=O)C(CCCNC(N)=N)NS(=O)(=O)c1ccc2cc(OC)c(OC)cc2c1
InChI Key: InChIKey=NWPBDBZSRAXKBY-UHFFFAOYSA-N
Data: 1 IC50
Activity Spreadsheet -- Enzyme Inhibition Constant Data from BindingDB
Found 1 hit for monomerid = 50404436
Trg + Lig
Ki
nM
ΔG°
kcal/mole
IC50
nM
Kd
nM
EC50/IC50
nM
koff
s-1
kon
M-1s-1
pHTemp
°C
Thrombin
(Bos taurus (Bovine))
BDBM50404436
(CHEMBL24318)
Show SMILES COCCN(CC(O)=O)C(=O)C(CCCNC(N)=N)NS(=O)(=O)c1ccc2cc(OC)c(OC)cc2c1
Show InChI InChI=1S/C23H33N5O8S/c1-34-10-9-28(14-21(29)30)22(31)18(5-4-8-26-23(24)25)27-37(32,33)17-7-6-15-12-19(35-2)20(36-3)13-16(15)11-17/h6-7,11-13,18,27H,4-5,8-10,14H2,1-3H3,(H,29,30)(H4,24,25,26)
n/an/a 300n/an/an/an/an/an/a
TBA
Curated by ChEMBL
Assay Description
Concentration at which the clotting time was prolonged by twice that of the control by inhibiting thrombin
J Med Chem 23: 1293-9 (1981)
BindingDB Entry DOI: 10.7270/Q2GQ6ZX5