BDBM50404724 CHEMBL156108
SMILES: OC(=O)c1cnc2cc(OCc3c(Cl)c(Cl)c(Cl)c(Cl)c3Cl)ccc2c1O
InChI Key: InChIKey=UHFJYZJYSZTRNV-UHFFFAOYSA-N
Data: 1 IC50
Activity Spreadsheet -- Enzyme Inhibition Constant Data from BindingDB
Found 1 hit for monomerid = 50404724
Trg + Lig
Ki
nM
ΔG°
kcal/mole
IC50
nM
Kd
nM
EC50/IC50
nM
koff
s-1
kon
M-1s-1
pHTemp
°C
Malate Dehydrogenase, mitochondrial
(Sus scrofa (pig))
BDBM50404724
(CHEMBL156108)
Show SMILES OC(=O)c1cnc2cc(OCc3c(Cl)c(Cl)c(Cl)c(Cl)c3Cl)ccc2c1O
Show InChI InChI=1S/C17H8Cl5NO4/c18-11-9(12(19)14(21)15(22)13(11)20)5-27-6-1-2-7-10(3-6)23-4-8(16(7)24)17(25)26/h1-4H,5H2,(H,23,24)(H,25,26)
Reactome pathway
n/an/a 4.79E+3n/an/an/an/an/an/a
TBA
Curated by ChEMBL
Assay Description
Ability to inhibit mitochondrial malate dehydrogenase
J Med Chem 25: 57-63 (1982)
BindingDB Entry DOI: 10.7270/Q2DR2WQV