null
SMILES: CCCCc1nc2cc(C)c(C)cc2[nH]1
InChI Key: InChIKey=JIQLFCSJXKTQKP-UHFFFAOYSA-N
Activity Spreadsheet -- Enzyme Inhibition Constant Data from BindingDB
Found 1 hit for monomerid = 50404922
Trg + Lig
Ki
nM
ΔG°
kcal/mole
IC50
nM
Kd
nM
EC50/IC50
nM
koff
s-1
kon
M-1s-1
pHTemp
°C
Cytochrome P450 2B1
(Rattus norvegicus)
BDBM50404922
(CHEMBL353807)
Show SMILES CCCCc1nc2cc(C)c(C)cc2[nH]1
Show InChI InChI=1S/C13H18N2/c1-4-5-6-13-14-11-7-9(2)10(3)8-12(11)15-13/h7-8H,4-6H2,1-3H3,(H,14,15)
n/an/a 5.50E+4n/an/an/an/an/an/a
TBA
Curated by ChEMBL
Assay Description
Inhibitory potency to aminopyrine N-demethylase activity (P450) in hepatic microsomes from phenobarbitone-induced rats.
J Med Chem 25: 887-92 (1982)
BindingDB Entry DOI: 10.7270/Q2VT1T8J