null
SMILES: Clc1ccccc1OCc1nc2ccccc2[nH]1
InChI Key: InChIKey=UIPOKFUXNJLYAO-UHFFFAOYSA-N
Activity Spreadsheet -- Enzyme Inhibition Constant Data from BindingDB
Found 1 hit for monomerid = 50404934
Trg + Lig
Ki
nM
ΔG°
kcal/mole
IC50
nM
Kd
nM
EC50/IC50
nM
koff
s-1
kon
M-1s-1
pHTemp
°C
Cytochrome P450 2B1
(Rattus norvegicus)
BDBM50404934
(CHEMBL172156)
Show SMILES Clc1ccccc1OCc1nc2ccccc2[nH]1
Show InChI InChI=1S/C14H11ClN2O/c15-10-5-1-4-8-13(10)18-9-14-16-11-6-2-3-7-12(11)17-14/h1-8H,9H2,(H,16,17)
n/an/a 2.69E+4n/an/an/an/an/an/a
TBA
Curated by ChEMBL
Assay Description
Inhibitory potency to aminopyrine N-demethylase activity (P450) in hepatic microsomes from phenobarbitone-induced rats.
J Med Chem 25: 887-92 (1982)
BindingDB Entry DOI: 10.7270/Q2VT1T8J