BDBM50405335 CHEMBL151747
SMILES: [#7]\[#6](-[#7])=[#7]/c1ccc(cc1)-[#6](=O)-[#8]-c1ccc(cc1)C#N
InChI Key: InChIKey=GXFBSLKCSCKIAZ-UHFFFAOYSA-N
Data: 2 IC50
Activity Spreadsheet -- Enzyme Inhibition Constant Data from BindingDB
Found 2 hits for monomerid = 50405335
Trg + Lig
Ki
nM
ΔG°
kcal/mole
IC50
nM
Kd
nM
EC50/IC50
nM
koff
s-1
kon
M-1s-1
pHTemp
°C
Trypsin-1
(Homo sapiens (Human))
BDBM50405335
(CHEMBL151747)
Show SMILES [#7]\[#6](-[#7])=[#7]/c1ccc(cc1)-[#6](=O)-[#8]-c1ccc(cc1)C#N
Show InChI InChI=1S/C15H12N4O2/c16-9-10-1-7-13(8-2-10)21-14(20)11-3-5-12(6-4-11)19-15(17)18/h1-8H,(H4,17,18,19)
Reactome pathway
n/an/a 1.60n/an/an/an/an/an/a
TBA
Curated by ChEMBL
Assay Description
Inhibition of human trypsin and the control activity being 7.3 umol/min/mg
J Med Chem 29: 514-9 (1986)
BindingDB Entry DOI: 10.7270/Q20C4WZ7
Acrosin
(Homo sapiens (Human))
BDBM50405335
(CHEMBL151747)
Show SMILES [#7]\[#6](-[#7])=[#7]/c1ccc(cc1)-[#6](=O)-[#8]-c1ccc(cc1)C#N
Show InChI InChI=1S/C15H12N4O2/c16-9-10-1-7-13(8-2-10)21-14(20)11-3-5-12(6-4-11)19-15(17)18/h1-8H,(H4,17,18,19)
Reactome pathway
n/an/a 1.20n/an/an/an/an/an/a
TBA
Curated by ChEMBL
Assay Description
Inhibition of human acrosin and control activity being 11.3 umol/min/mg
J Med Chem 29: 514-9 (1986)
BindingDB Entry DOI: 10.7270/Q20C4WZ7