BDBM50405338 CHEMBL150009
SMILES: [#7]\[#6](-[#7])=[#7]/c1ccc(cc1)-[#6](=O)-[#8]-c1cccc(c1)C(F)(F)F
InChI Key: InChIKey=PEDVWMGVIMYXMN-UHFFFAOYSA-N
Data: 2 IC50
Activity Spreadsheet -- Enzyme Inhibition Constant Data from BindingDB
Found 2 hits for monomerid = 50405338
Trg + Lig
Ki
nM
ΔG°
kcal/mole
IC50
nM
Kd
nM
EC50/IC50
nM
koff
s-1
kon
M-1s-1
pHTemp
°C
Acrosin
(Homo sapiens (Human))
BDBM50405338
(CHEMBL150009)
Show SMILES [#7]\[#6](-[#7])=[#7]/c1ccc(cc1)-[#6](=O)-[#8]-c1cccc(c1)C(F)(F)F
Show InChI InChI=1S/C15H12F3N3O2/c16-15(17,18)10-2-1-3-12(8-10)23-13(22)9-4-6-11(7-5-9)21-14(19)20/h1-8H,(H4,19,20,21)
Reactome pathway
n/an/a 38.5n/an/an/an/an/an/a
TBA
Curated by ChEMBL
Assay Description
Inhibition of human acrosin and control activity being 11.3 umol/min/mg
J Med Chem 29: 514-9 (1986)
BindingDB Entry DOI: 10.7270/Q20C4WZ7
Trypsin-1
(Homo sapiens (Human))
BDBM50405338
(CHEMBL150009)
Show SMILES [#7]\[#6](-[#7])=[#7]/c1ccc(cc1)-[#6](=O)-[#8]-c1cccc(c1)C(F)(F)F
Show InChI InChI=1S/C15H12F3N3O2/c16-15(17,18)10-2-1-3-12(8-10)23-13(22)9-4-6-11(7-5-9)21-14(19)20/h1-8H,(H4,19,20,21)
Reactome pathway
n/an/a 92.2n/an/an/an/an/an/a
TBA
Curated by ChEMBL
Assay Description
Inhibition of human trypsin and the control activity being 7.3 umol/min/mg
J Med Chem 29: 514-9 (1986)
BindingDB Entry DOI: 10.7270/Q20C4WZ7