BDBM50405339 CHEMBL149156
SMILES: [#6]-[#6](-[#6])-c1ccc(-[#6])cc1-[#8]-[#6](=O)-c1ccc(cc1)\[#7]=[#6](/[#7])-[#7]
InChI Key: InChIKey=NUDMLXKJIHBMCP-UHFFFAOYSA-N
Data: 2 IC50
Activity Spreadsheet -- Enzyme Inhibition Constant Data from BindingDB
Found 2 hits for monomerid = 50405339
Trg + Lig
Ki
nM
ΔG°
kcal/mole
IC50
nM
Kd
nM
EC50/IC50
nM
koff
s-1
kon
M-1s-1
pHTemp
°C
Acrosin
(Homo sapiens (Human))
BDBM50405339
(CHEMBL149156)
Show SMILES [#6]-[#6](-[#6])-c1ccc(-[#6])cc1-[#8]-[#6](=O)-c1ccc(cc1)\[#7]=[#6](/[#7])-[#7]
Show InChI InChI=1S/C18H21N3O2/c1-11(2)15-9-4-12(3)10-16(15)23-17(22)13-5-7-14(8-6-13)21-18(19)20/h4-11H,1-3H3,(H4,19,20,21)
Reactome pathway
n/an/a 300n/an/an/an/an/an/a
TBA
Curated by ChEMBL
Assay Description
Inhibition of human acrosin and control activity being 11.3 umol/min/mg
J Med Chem 29: 514-9 (1986)
BindingDB Entry DOI: 10.7270/Q20C4WZ7
Trypsin-1
(Homo sapiens (Human))
BDBM50405339
(CHEMBL149156)
Show SMILES [#6]-[#6](-[#6])-c1ccc(-[#6])cc1-[#8]-[#6](=O)-c1ccc(cc1)\[#7]=[#6](/[#7])-[#7]
Show InChI InChI=1S/C18H21N3O2/c1-11(2)15-9-4-12(3)10-16(15)23-17(22)13-5-7-14(8-6-13)21-18(19)20/h4-11H,1-3H3,(H4,19,20,21)
Reactome pathway
n/an/a 500n/an/an/an/an/an/a
TBA
Curated by ChEMBL
Assay Description
Inhibition of human trypsin and the control activity being 7.3 umol/min/mg
J Med Chem 29: 514-9 (1986)
BindingDB Entry DOI: 10.7270/Q20C4WZ7