BDBM50405340 CHEMBL146905
SMILES: [#6]C([#6])([#6])c1ccc(-[#8]-[#6](=O)-c2ccc(cc2)\[#7]=[#6](/[#7])-[#7])cc1
InChI Key: InChIKey=QKIICUBVSHYYQV-UHFFFAOYSA-N
Data: 2 IC50
Activity Spreadsheet -- Enzyme Inhibition Constant Data from BindingDB
Found 2 hits for monomerid = 50405340
Trg + Lig
Ki
nM
ΔG°
kcal/mole
IC50
nM
Kd
nM
EC50/IC50
nM
koff
s-1
kon
M-1s-1
pHTemp
°C
Trypsin-1
(Homo sapiens (Human))
BDBM50405340
(CHEMBL146905)
Show SMILES [#6]C([#6])([#6])c1ccc(-[#8]-[#6](=O)-c2ccc(cc2)\[#7]=[#6](/[#7])-[#7])cc1
Show InChI InChI=1S/C18H21N3O2/c1-18(2,3)13-6-10-15(11-7-13)23-16(22)12-4-8-14(9-5-12)21-17(19)20/h4-11H,1-3H3,(H4,19,20,21)
Reactome pathway
n/an/a 17.1n/an/an/an/an/an/a
TBA
Curated by ChEMBL
Assay Description
Inhibition of human trypsin and the control activity being 7.3 umol/min/mg
J Med Chem 29: 514-9 (1986)
BindingDB Entry DOI: 10.7270/Q20C4WZ7
Acrosin
(Homo sapiens (Human))
BDBM50405340
(CHEMBL146905)
Show SMILES [#6]C([#6])([#6])c1ccc(-[#8]-[#6](=O)-c2ccc(cc2)\[#7]=[#6](/[#7])-[#7])cc1
Show InChI InChI=1S/C18H21N3O2/c1-18(2,3)13-6-10-15(11-7-13)23-16(22)12-4-8-14(9-5-12)21-17(19)20/h4-11H,1-3H3,(H4,19,20,21)
Reactome pathway
n/an/a 28.5n/an/an/an/an/an/a
TBA
Curated by ChEMBL
Assay Description
Inhibition of human acrosin and control activity being 11.3 umol/min/mg
J Med Chem 29: 514-9 (1986)
BindingDB Entry DOI: 10.7270/Q20C4WZ7