BDBM50405473 CHEMBL8549
SMILES: CCCCCC(=O)c1cccc(OCc2ccc3ccccc3n2)c1
InChI Key: InChIKey=LHFXTLCYZARWLB-UHFFFAOYSA-N
Data: 1 IC50
Activity Spreadsheet -- Enzyme Inhibition Constant Data from BindingDB
Found 1 hit for monomerid = 50405473
Trg + Lig
Ki
nM
ΔG°
kcal/mole
IC50
nM
Kd
nM
EC50/IC50
nM
koff
s-1
kon
M-1s-1
pHTemp
°C
Arachidonate 5-lipoxygenase
(Rattus norvegicus)
BDBM50405473
(CHEMBL8549)
Show SMILES CCCCCC(=O)c1cccc(OCc2ccc3ccccc3n2)c1
Show InChI InChI=1S/C22H23NO2/c1-2-3-4-12-22(24)18-9-7-10-20(15-18)25-16-19-14-13-17-8-5-6-11-21(17)23-19/h5-11,13-15H,2-4,12,16H2,1H3
n/an/a 370n/an/an/an/an/an/a
TBA
Curated by ChEMBL
Assay Description
Inhibition of rat neutrophil 5- Lipoxygenase (5-LO)
J Med Chem 30: 96-104 (1987)
BindingDB Entry DOI: 10.7270/Q2PV6MKS