BDBM50405526 CHEMBL543955
SMILES: CC(C)NCC(O)COc1ccc(CCOCC2CCC2)cc1
InChI Key: InChIKey=QHLVYAZGIZCFCW-UHFFFAOYSA-N
Data: 3 Kd
Activity Spreadsheet -- Enzyme Inhibition Constant Data from BindingDB
Found 3 hits for monomerid = 50405526
Trg + Lig
Ki
nM
ΔG°
kcal/mole
IC50
nM
Kd
nM
EC50/IC50
nM
koff
s-1
kon
M-1s-1
pHTemp
°C
Beta-1 adrenergic receptor
(Rattus norvegicus (Rat))
BDBM50405526
(CHEMBL543955)
Show SMILES CC(C)NCC(O)COc1ccc(CCOCC2CCC2)cc1
Show InChI InChI=1S/C19H31NO3/c1-15(2)20-12-18(21)14-23-19-8-6-16(7-9-19)10-11-22-13-17-4-3-5-17/h6-9,15,17-18,20-21H,3-5,10-14H2,1-2H3
Reactome pathway
n/an/an/a 0.282n/an/an/an/an/a
TBA
Curated by ChEMBL
Assay Description
Antagonist activity was determined against beta-1 adrenergic receptor in spontaneously beating rat atria
J Med Chem 30: 1003-11 (1987)
BindingDB Entry DOI: 10.7270/Q2251KC9
Beta-1 adrenergic receptor
(Rattus norvegicus (Rat))
BDBM50405526
(CHEMBL543955)
Show SMILES CC(C)NCC(O)COc1ccc(CCOCC2CCC2)cc1
Show InChI InChI=1S/C19H31NO3/c1-15(2)20-12-18(21)14-23-19-8-6-16(7-9-19)10-11-22-13-17-4-3-5-17/h6-9,15,17-18,20-21H,3-5,10-14H2,1-2H3
Reactome pathway
n/an/an/a 0.275n/an/an/an/an/a
TBA
Curated by ChEMBL
Assay Description
Cardioselectivity for the beta-1 adrenergic receptor was determined against isoprenaline (antagonism) in isolated rat atria
J Med Chem 30: 1003-11 (1987)
BindingDB Entry DOI: 10.7270/Q2251KC9
Beta-1 adrenergic receptor
(GUINEA PIG)
BDBM50405526
(CHEMBL543955)
Show SMILES CC(C)NCC(O)COc1ccc(CCOCC2CCC2)cc1
Show InChI InChI=1S/C19H31NO3/c1-15(2)20-12-18(21)14-23-19-8-6-16(7-9-19)10-11-22-13-17-4-3-5-17/h6-9,15,17-18,20-21H,3-5,10-14H2,1-2H3
n/an/an/a 955n/an/an/an/an/a
TBA
Curated by ChEMBL
Assay Description
Cardioselectivity for the beta-1 adrenergic receptor was determined against isoprenaline (antagonism) in isolated guinea pig trachea
J Med Chem 30: 1003-11 (1987)
BindingDB Entry DOI: 10.7270/Q2251KC9